{"text_format":"1","workbook":"xlsx","n_sheets":11,"sheets":["FICHA","REGLAS","DPTO","PROV","ENTIDAD","GRS","TIPOGOB","Evaluación2019","LISTA","TOTAL","ANEXO 1 GL"],"not_rendered":{"charts":0,"images":6,"macros":1,"external_links":1,"defined_names":18,"comments":0,"pivot_tables":0},"unopened":[],"bounds":{"document_bytes":16777216,"sheet_cells":100000,"rows_first":2000,"rows_last":500,"rows_between":2000,"halvings":0,"cell_chars":16384,"cell_head_chars":4096},"cells_cut":0,"cells_raw":0,"read":"whole","date_system":"1900"}

{"sheet":"FICHA","index":0,"n_rows":32,"n_cols":26,"rows_kept":32,"cut":false,"hidden":false,"merged":[[24,1,24,4],[30,1,30,4],[8,4,9,4],[0,1,0,4],[1,1,1,3],[23,1,23,4],[6,2,6,4]]}
[null,"ANEXO N° 2 : CUMPLIMIENTO DE LOS COMPROMISOS DE AJUSTE FISCAL 2025"]
[]
[null,"DEPARTAMENTO"]
[null,"PROVINCIA"]
[null,"ENTIDAD",null,null,null,null,null,null,null,null,null,null,null,null,null,null,null,null,null,null,null,null,null,null,null,"030502 : MUNICIPALIDAD DISTRITAL DE COTABAMBAS"]
[]
[null,"RESUMEN DE EVALUACIÓN",{"$f":"CONCATENATE(\"VERSIÓN  :    \",IFERROR(VLOOKUP(Z5,REGLAS!$A$3:$AD$89,2,FALSE),\" \"))","v":"VERSIÓN  :    General"},null,null,null,null,null,null,null,null,null,null,null,null,null,null,null,null,null,null,null,null,null,null,{"$f":"IFERROR(VLOOKUP(Z5,REGLAS!$A$3:$AD$69,2,FALSE),\" \")","v":"General"}]
[null,"R1: Regla Fiscal de Saldo de Deuda Total  :",{"$f":"IFERROR( VLOOKUP(Z5,REGLAS!$A$3:$AD$100,29,FALSE), \" \")","v":"No Cumple"},null,"Evaluación"]
[null,"R2: Regla Fiscal de Ahorro en cuenta corriente  :",{"$f":"IFERROR( VLOOKUP(Z5,REGLAS!$A$3:$AD$100,30,FALSE), \" \")","v":"Si Cumple"},null,{"$f":"IFERROR( VLOOKUP(Z5,REGLAS!$A$3:$AD$100,28,FALSE), \" \")","v":"Desfavorable"}]
[null,"Logro 9/ :",{"$f":"IFERROR( VLOOKUP(Z5,REGLAS!$A$3:$AD$100,27,FALSE), \" \")","v":0.30000000000000004}]
{"$rows_left_out":23}
{"sheet":"REGLAS","index":1,"n_rows":100,"n_cols":30,"rows_kept":100,"cut":false,"hidden":true,"merged":[[0,29,1,29],[0,17,0,19],[0,20,0,22],[0,23,0,25],[0,26,1,26],[0,27,1,27],[0,28,1,28],[0,14,0,16],[0,1,1,1],[0,2,0,4],[0,5,0,7],[0,8,0,10],[0,11,0,13]]}
[null,"Tipo de CAF","CF 1",null,null,"CF 2",null,null,"CF 3",null,null,"CF 4",null,null,"CF 5",null,null,"CF 6",null,null,"CF 7",null,null,"CF 8",null,null,"LOGRO 9/\n(%)","EVALUACIÓN","REGLA FISCAL 10/\nSDT","REGLAS FISCAL 11/\nACC"]
["busqueda",null,"Meta","Resultado","CUMPLE","Meta","Resultado","CUMPLE","Meta","Resultado","CUMPLE","Meta","Resultado","CUMPLE","Meta","Resultado","CUMPLE","Meta","Resultado","CUMPLE","Meta","Resultado","CUMPLE","Meta","Resultado","CUMPLE"]
["030101 : MUNICIPALIDAD PROVINCIAL DE ABANCAY","General",2.2000000000000002,20.001575366893491,"Cumple",23,9.328340034767308,"No Cumple",40,42.538925468547781,"No Cumple",-1,7.3762946374389617,"No Cumple",2,2,"Cumple",3,3,"Cumple","No aplica","No aplica","No aplica","No aplica","No aplica","No aplica",0.60000000000000009,"Desfavorable","No Cumple","Si Cumple"]
["030201 : MUNICIPALIDAD PROVINCIAL DE ANDAHUAYLAS","General",3.9,12.635647305006428,"Cumple",3.9,6.1277357347219974,"Cumple",24.5,24.172797968295828,"Cumple",-1,7.7919427942507813,"No Cumple",2,2,"Cumple",3,3,"Cumple","No aplica","No aplica","No aplica","No aplica","No aplica","No aplica",0.89999999999999991,"Favorable","No Cumple","Si Cumple"]
["030601 : MUNICIPALIDAD PROVINCIAL DE CHINCHEROS","General",0.01,13.99668143027953,"Cumple",0,3.969018649486312,"Cumple",34.200000000000003,25.7432222189627,"Cumple",-30,-91.788031014562677,"Cumple",2,1,"No Cumple",3,3,"Cumple","No aplica","No aplica","No aplica","No aplica","No aplica","No aplica",0.8,"Favorable","No Cumple","Si Cumple"]
["030502 : MUNICIPALIDAD DISTRITAL DE COTABAMBAS","General",0.5,2833.2930597848836,"Cumple",0.5,0,"No Cumple",54.4,23.989656485815239,"Cumple",-3.1,3.4989984470283462,"No Cumple",2,0,"No Cumple",3,0,"No Cumple","No aplica","No aplica","No aplica","No aplica","No aplica","No aplica",0.30000000000000004,"Desfavorable","No Cumple","Si Cumple"]
["030701 : MUNICIPALIDAD PROVINCIAL DE GRAU - CHUQUIBAMBILLA","General",14,108.35850557153243,"Cumple",40,6.8071535202573914,"No Cumple",33,26.519645107709092,"Cumple",-4.0999999999999996,5.6969009212917792,"No Cumple",2,2,"Cumple",3,3,"Cumple","No aplica","No aplica","No aplica","No aplica","No aplica","No aplica",0.7,"Desfavorable","No Cumple","Si Cumple"]
["051101 : MUNICIPALIDAD PROVINCIAL DE VILCAS HUAMAN","General",3,-24.485875916689238,"No Cumple",1,1.9677462528857077,"Cumple",16.7,18.53274250369099,"No Cumple",-1,-85.255321319933685,"Cumple",2,2,"Cumple",3,0,"No Cumple","No aplica","No aplica","No aplica","No aplica","No aplica","No aplica",0.5,"Desfavorable","No Cumple","Si Cumple"]
["070102 : MUNICIPALIDAD DISTRITAL DE BELLAVISTA","General",3,3.0670297451358,"Cumple",54,43.279404905269189,"No Cumple",46.5,47.453486672989918,"No Cumple",-5,-5.3709707653134977,"Cumple",2,2,"Cumple",3,3,"Cumple","No aplica","No aplica","No aplica","No aplica","No aplica","No aplica",0.7,"Desfavorable","Si Cumple","Si Cumple"]
["070101 : MUNICIPALIDAD PROVINCIAL DEL CALLAO","General",2,4.1797339656589632,"Cumple",56.8,58.561545910314138,"Cumple",39.299999999999997,28.394519125807943,"Cumple",-0.5,5.1624232632761009,"No Cumple",2,2,"Cumple",3,3,"Cumple","No aplica","No aplica","No aplica","No aplica","No aplica","No aplica",0.89999999999999991,"Favorable","No Cumple","Si Cumple"]
{"$rows_left_out":91}
{"sheet":"DPTO","index":2,"n_rows":21,"n_cols":3,"rows_kept":21,"cut":false,"hidden":true,"merged":[]}
["--------------------","CODI_DEP","DESC_DEP"]
["03:APURÍMAC","03","APURÍMAC"]
["05:AYACUCHO","05","AYACUCHO"]
["07:CALLAO","07","CALLAO"]
["11:ICA","11","ICA"]
["13:LA LIBERTAD","13","LA LIBERTAD"]
["14:LAMBAYEQUE","14","LAMBAYEQUE"]
["15:LIMA","15","LIMA"]
["20:PIURA","20","PIURA"]
["24:TUMBES","24","TUMBES"]
{"$rows_left_out":12}
{"sheet":"PROV","index":3,"n_rows":55,"n_cols":4,"rows_kept":55,"cut":false,"hidden":true,"merged":[]}
["PROV","CODI_DEP","CODI_PRO","DESC_PRO"]
["0301 : ABANCAY","03","01","ABANCAY"]
["0302 : ANDAHUAYLAS","03","02","ANDAHUAYLAS"]
["0306 : CHINCHEROS","03","06","CHINCHEROS"]
["0305 : COTABAMBAS","03","05","COTABAMBAS"]
["0307 : GRAU","03","07","GRAU"]
["0511 : VILCAS HUAMAN","05","11","VILCAS HUAMAN"]
["0701 : CALLAO","07","01","CALLAO"]
["1105 : PISCO","11","05","PISCO"]
["1302 : ASCOPE","13","02","ASCOPE"]
{"$rows_left_out":46}
{"sheet":"ENTIDAD","index":4,"n_rows":99,"n_cols":1,"rows_kept":99,"cut":false,"hidden":true,"merged":[]}
["ENTIDADES"]
["030101 : MUNICIPALIDAD PROVINCIAL DE ABANCAY"]
["030201 : MUNICIPALIDAD PROVINCIAL DE ANDAHUAYLAS"]
["030601 : MUNICIPALIDAD PROVINCIAL DE CHINCHEROS"]
["030502 : MUNICIPALIDAD DISTRITAL DE COTABAMBAS"]
["030701 : MUNICIPALIDAD PROVINCIAL DE GRAU - CHUQUIBAMBILLA"]
["051101 : MUNICIPALIDAD PROVINCIAL DE VILCAS HUAMAN"]
["070102 : MUNICIPALIDAD DISTRITAL DE BELLAVISTA"]
["070101 : MUNICIPALIDAD PROVINCIAL DEL CALLAO"]
["070103 : MUNICIPALIDAD DISTRITAL DE CARMEN DE LA LEGUA REYNOSO"]
{"$rows_left_out":90}
{"sheet":"GRS","index":5,"n_rows":8,"n_cols":1,"rows_kept":8,"cut":false,"hidden":true,"merged":[]}
["-----------------------------------------------"]
["040000 : GOBIERNO REGIONAL DE AREQUIPA"]
["060000 : GOBIERNO REGIONAL DE CAJAMARCA"]
["130000 : GOBIERNO REGIONAL DE LA LIBERTAD"]
["150100 : REGION LIMA METROPOLITANA"]
["180000 : GOBIERNO REGIONAL DE MOQUEGUA"]
["200000 : GOBIERNO REGIONAL DE PIURA"]
["210000 : GOBIERNO REGIONAL DE PUNO"]

{"sheet":"TIPOGOB","index":6,"n_rows":7,"n_cols":1,"rows_kept":7,"cut":false,"hidden":true,"merged":[]}
["TIPOGOB"]
["Gobiernos Locales"]
["Gobiernos Regionales"]
[]
[]
["No Cumple"]
["Si Cumple"]

{"sheet":"Evaluación2019","index":7,"n_rows":157,"n_cols":46,"rows_kept":157,"cut":false,"hidden":true,"merged":[[1,45,2,45],[1,28,1,30],[1,32,1,34],[1,36,1,38],[1,40,2,40],[1,42,2,42],[1,44,2,44],[1,24,1,26],[1,0,2,0],[1,1,2,1],[1,2,2,2],[1,3,2,3],[1,4,2,4],[1,5,2,5],[1,6,2,6],[1,8,1,10],[1,12,1,14],[1,16,1,18],[1,20,1,22]]}
["Anexo N° 2: Cumplimiento de los Compromisos Fiscales contenidos en el documento \"Compromisos de Ajuste Fiscal\" 2019"]
["Ítem","Ubigeo","Departamento","Provincia","Distrito","Gobierno Regional/ Gobiernos Local","Tipo de CAF",null,"CF1 1/",null,null,null,"CF2 2/",null,null,null,"CF3 3/",null,null,null,"CF4 4/",null,null,null,"CF5 5/",null,null,null,"CF6 6/",null,null,null,"CF7 7/",null,null,null,"CF8 8/",null,null,null,"Evaluación Global (%) 9/",null,"Opinión del CAF",null,"Cumplimiento de la RFSDT 10/","Cumplimiento de la RFACC 11/"]
[null,null,null,null,null,null,null,null,"Meta  (%)","Resultado (%)","Cumple",null,"Meta  (%)","Resultado (%)","Cumple",null,"Meta  (%)","Resultado (%)","Cumple",null,"Meta  (%)","Resultado (%)","Cumple",null,"Meta (Nº)","Resultado (Nº)","Cumple",null,"Meta (Nº)","Resultado (Nº)","Cumple",null,"Meta  (%)","Resultado (%)","Cumple",null,"Meta  (S/)","Resultado (S/)","Cumple"]
[1,"040000","AREQUIPA",null,null,"GOBIERNO REGIONAL DE AREQUIPA","Completo",null,"No aplica","No aplica","No aplica",null,"No aplica","No aplica","No aplica",null,7.28,6.8230236214562767,{"$f":"IF(R4<=Q4,\"Cumple\",\"No cumple\")","v":"Cumple"},null,-22,-17.017677170604784,{"$f":"IF(V4<=U4,\"Cumple\",\"No cumple\")","v":"No cumple"},null,2,1,{"$f":"IF(Z4>=2,\"Cumple\",\"No cumple\")","v":"No cumple"},null,3,3,{"$f":"IF($AD4>=3,\"Cumple\",\"No cumple\")","v":"Cumple"},null,"No aplica","No aplica","No aplica",null,"No aplica","No aplica","No aplica",null,{"$f":"COUNTIF(I4:AM4,\"Cumple\")/4*100","v":50},null,{"$f":"IF(AO4>=80,\"Favorable\",\"Desfavorable\")","v":"Desfavorable"},null,"Cumple","Cumple"]
[2,"180000","MOQUEGUA",null,null,"GOBIERNO REGIONAL DE MOQUEGUA","Completo",null,"No aplica","No aplica","No aplica",null,"No aplica","No aplica","No aplica",null,11.1,11.872918392131687,{"$f":"IF(R5<=Q5,\"Cumple\",\"No cumple\")","v":"No cumple"},null,4.0999999999999996,71.312270057775365,{"$f":"IF(V5<=U5,\"Cumple\",\"No cumple\")","v":"No cumple"},null,2,1,{"$f":"IF(Z5>=2,\"Cumple\",\"No cumple\")","v":"No cumple"},null,3,0,{"$f":"IF($AD5>=3,\"Cumple\",\"No cumple\")","v":"No cumple"},null,"No aplica","No aplica","No aplica",null,"No aplica","No aplica","No aplica",null,{"$f":"COUNTIF(I5:AM5,\"Cumple\")/4*100","v":0},null,{"$f":"IF(AO5>=80,\"Favorable\",\"Desfavorable\")","v":"Desfavorable"},null,"No Cumple","Cumple"]
[3,"200000","PIURA",null,null,"GOBIERNO REGIONAL DE PIURA","Completo",null,"No aplica","No aplica","No aplica",null,"No aplica","No aplica","No aplica",null,9.5,9.7814608671154932,"No cumple",null,-12,-49.021622883993409,"Cumple",null,2,2,"Cumple",null,7,7,"Cumple",null,"No aplica","No aplica","No aplica",null,"No aplica","No aplica","No aplica",null,{"$f":"COUNTIF(I6:AM6,\"Cumple\")/4*100","v":75},null,"Desfavorable",null,"No Cumple","Cumple"]
[4,"210000","PUNO",null,null,"GOBIERNO REGIONAL DE PUNO","Completo",null,"No aplica","No aplica","No aplica",null,"No aplica","No aplica","No aplica",null,7.01,6.8873364716595127,"Cumple",null,-8.5,54.441589350313883,"No cumple",null,2,0,"No cumple",null,3,0,"No cumple",null,"No aplica","No aplica","No aplica",null,"No aplica","No aplica","No aplica",null,{"$f":"COUNTIF(I7:AM7,\"Cumple\")/4*100","v":25},null,"Desfavorable",null,"Cumple","Cumple"]
[1,"030101","APURIMAC","ABANCAY","ABANCAY","MUNICIPALIDAD PROVINCIAL DE ABANCAY","Completo",null,5.3,6.2092506552785149,{"$f":"IF(J8>I8,\"Cumple\",\"No cumple\")","v":"Cumple"},null,25,38.962265388498579,{"$f":"IF(N8>=M8,\"Cumple\",\"No cumple\")","v":"Cumple"},null,22.4,26.003844608128261,"No cumple",null,-99.2,9.6506214343159744,"No cumple",null,2,1,"No cumple",null,4,1,"No cumple",null,"No aplica","No aplica","No aplica",null,"No aplica","No aplica","No aplica",null,{"$f":"COUNTIF(I8:AM8,\"Cumple\")/6*100","v":33.333333333333329},null,"Desfavorable",null,"No Cumple","Cumple"]
[2,"030201","APURIMAC","ANDAHUAYLAS","ANDAHUAYLAS","MUNICIPALIDAD PROVINCIAL DE ANDAHUAYLAS","Completo",null,24.8,29.5210253672407,{"$f":"IF(J9>I9,\"Cumple\",\"No cumple\")","v":"Cumple"},null,14,5.2539086621864,{"$f":"IF(N9>=M9,\"Cumple\",\"No cumple\")","v":"No cumple"},null,31.7,30.436877572341821,"Cumple",null,-90.9,-19.236230662918778,"No cumple",null,2,1,"No cumple",null,5,0,"No cumple",null,"No aplica","No aplica","No aplica",null,"No aplica","No aplica","No aplica",null,33.333333333333329,null,"Desfavorable",null,"No Cumple","Cumple"]
[3,"030501","APURIMAC","COTABAMBA","TAMBOBAMBA","MUNICIPALIDAD PROVINCIAL DE COTABAMBAS - TAMBOBAMBA","Completo",null,3.3,54.225634601495727,"Cumple",null,0,0,"Cumple",null,20.2,25.036257029824277,"No cumple",null,-75,-78.298700729814769,"Cumple",null,2,2,"Cumple",null,7,6,"Cumple",null,"No aplica","No aplica","No aplica",null,"No aplica","No aplica","No aplica",null,83.333333333333343,null,"Favorable",null,"No Cumple","Cumple"]
{"$rows_left_out":148}
{"sheet":"LISTA","index":8,"n_rows":144,"n_cols":31,"rows_kept":144,"cut":false,"hidden":true,"merged":[[0,18,0,20],[0,21,0,23],[0,24,0,26],[0,3,0,5],[0,6,0,8],[0,9,0,11],[0,12,0,14],[0,15,0,17]]}
[null,null,null,"CF 1",null,null,"CF 2",null,null,"CF 3",null,null,"CF 4",null,null,"CF 5",null,null,"CF 6",null,null,"CF 7",null,null,"CF 8"]
["ENTIDAD","codi_niv","Tipo de CAF","Meta","Resultado","Cumplimiento","Meta","Resultado","Cumplimiento","Meta","Resultado","Cumplimiento","Meta","Resultado","Cumplimiento","Meta","Resultado","Cumplimiento","Meta","Resultado","Cumplimiento","Meta","Resultado","Cumplimiento","Meta","Resultado","Cumplimiento","Logro","Evaluación","Regla Fiscal\nSDT","Regla Fiscal\nACC"]
["010112 : MUNICIPALIDAD DISTRITAL DE MAGDALENA","0101030101","CAF SIMPLIFICADO",null,null,null,null,null,null,null,null,null,null,null,null,null,null,null,null,null,null,100,3.0146864033480174,"Cumple",0,192.0803500000001,"Cumple",{"$f":"COUNTIF(D3:AA3,\"Cumple\")/2*100","v":100},{"$f":"IF(AB3>=80,\"Favorable\",\"Desfavorable\")","v":"Favorable"},"Cumple","Cumple"]
["010120 : MUNICIPALIDAD DISTRITAL DE SOLOCO","0101030101","CAF SIMPLIFICADO",null,null,null,null,null,null,null,null,null,null,null,null,null,null,null,null,null,null,100,99.346668927204973,"Cumple",0,952.7661599999999,"Cumple",100,"Favorable","Cumple","Cumple"]
["010302 : MUNICIPALIDAD DISTRITAL DE CHISQUILLA","0101030101","CAF SIMPLIFICADO",null,null,null,null,null,null,null,null,null,null,null,null,null,null,null,null,null,null,1.1000000000000001,3.0454114835125123,"No cumple",523.74,104.45427000000008,"No cumple",0,"Desfavorable","Cumple","Cumple"]
["010503 : MUNICIPALIDAD DISTRITAL DE COCABAMBA","0101030101","CAF SIMPLIFICADO",null,null,null,null,null,null,null,null,null,null,null,null,null,null,null,null,null,null,100,175.33526634154569,"No cumple",0,451.87850999999989,"Cumple",50,"Desfavorable","No Cumple","Cumple"]
["010504 : MUNICIPALIDAD DISTRITAL DE COLCAMAR","0101030101","CAF SIMPLIFICADO",null,null,null,null,null,null,null,null,null,null,null,null,null,null,null,null,null,null,97,4.1727514858959269,"Cumple",289,186.49939000000001,"No cumple",50,"Desfavorable","Cumple","Cumple"]
["010522 : MUNICIPALIDAD DISTRITAL DE TINGO","0101030101","CAF SIMPLIFICADO",null,null,null,null,null,null,null,null,null,null,null,null,null,null,null,null,null,null,45,12.93167658245846,"Cumple",0,156.13718999999995,"Cumple",100,"Favorable","Cumple","Cumple"]
["010602 : MUNICIPALIDAD DISTRITAL DE CHIRIMOTO","0101030101","CAF SIMPLIFICADO",null,null,null,null,null,null,null,null,null,null,null,null,null,null,null,null,null,null,100,4.254473047263625,"Cumple",0,221.08784000000009,"Cumple",100,"Favorable","Cumple","Cumple"]
["010605 : MUNICIPALIDAD DISTRITAL DE LIMABAMBA","0101030101","CAF SIMPLIFICADO",null,null,null,null,null,null,null,null,null,null,null,null,null,null,null,null,null,null,100,240.10314301478729,"No cumple",0,354.67172999999985,"Cumple",50,"Desfavorable","No Cumple","Cumple"]
{"$rows_left_out":135}
{"sheet":"TOTAL","index":9,"n_rows":146,"n_cols":16,"rows_kept":146,"cut":false,"hidden":true,"merged":[[2,13,3,13],[2,14,3,14],[2,3,3,3],[2,15,3,15],[2,0,3,0],[2,1,3,1],[2,2,3,2],[2,4,2,11],[2,12,3,12]]}
[]
[]
["UBIGEO","DEPARTAMENTO","MUNICIPALIDAD","Tipo de CAF","CUMPLIMIENTO DE LOS COMPROMISOS DE AJUSTE FISCAL",null,null,null,null,null,null,null,"Logro","Evaluación","Regla Fiscal\nSDT","Regla Fiscal\nACC"]
[null,null,null,null,"CF 1","CF2","CF 3","CF 4","CF 5","CF 6","CF 7","CF 8"]
["010112","AMAZONAS"," MUNICIPALIDAD DISTRITAL DE MAGDALENA","CAF SIMPLIFICADO",null,null,null,null,null,null,"Cumple","Cumple",100,"Favorable","Cumple","Cumple"]
["010120","AMAZONAS"," MUNICIPALIDAD DISTRITAL DE SOLOCO","CAF SIMPLIFICADO",null,null,null,null,null,null,"Cumple","Cumple",100,"Favorable","Cumple","Cumple"]
["010302","AMAZONAS"," MUNICIPALIDAD DISTRITAL DE CHISQUILLA","CAF SIMPLIFICADO",null,null,null,null,null,null,"No cumple","No cumple",0,"Desfavorable","Cumple","Cumple"]
["010503","AMAZONAS"," MUNICIPALIDAD DISTRITAL DE COCABAMBA","CAF SIMPLIFICADO",null,null,null,null,null,null,"No cumple","Cumple",50,"Desfavorable","No Cumple","Cumple"]
["010504","AMAZONAS"," MUNICIPALIDAD DISTRITAL DE COLCAMAR","CAF SIMPLIFICADO",null,null,null,null,null,null,"Cumple","No cumple",50,"Desfavorable","Cumple","Cumple"]
["010522","AMAZONAS"," MUNICIPALIDAD DISTRITAL DE TINGO","CAF SIMPLIFICADO",null,null,null,null,null,null,"Cumple","Cumple",100,"Favorable","Cumple","Cumple"]
{"$rows_left_out":137}
{"sheet":"ANEXO 1 GL","index":10,"n_rows":118,"n_cols":17,"rows_kept":118,"cut":false,"hidden":false,"merged":[[114,0,114,16],[3,0,3,16],[5,0,6,0],[5,1,6,1],[5,2,6,2],[5,3,6,3],[5,4,6,4],[5,5,5,12],[5,13,6,13],[5,14,6,14],[5,15,6,15],[5,16,6,16]]}
["Anexo N° 1: Cumplimiento de los Compromisos Fiscales contenidos en el documento \"Compromisos de Ajuste Fiscal\" 2025"]
["Gobiernos Locales"]
[]
["CAF Simplificado aplica a los GL que incumplieron las reglas fiscales pertenecientes al primer grupo de la Tipología de la situación fiscal (con promedio de Ingresos Corrientes Totales de los últimos 04 años iguales o superiores a 2300 UIT anuales) con incumplimientos Leves y a los GL pertenecientes al segundo grupo (con promedio de Ingresos Corrientes Totales de los últimos 04 años inferiores a 2300 UIT anuales) con incumplimientos Muy Graves, Graves o Leves. El resto de GL elabora el CAF General."]
[]
["Nº","UBIGEO","DEPARTAMENTO","MUNICIPALIDAD","VERSIÓN","CUMPLIMIENTO DE LOS COMPROMISOS DE AJUSTE FISCAL",null,null,null,null,null,null,null,"LOGRO 9/\n(%)","EVALUACIÓN","REGLA FISCAL 10/\nSDT","REGLAS FISCAL 11/\nACC"]
[null,null,null,null,null,"CF 1 1/","CF2 2/","CF 3 3/","CF 4 4/","CF 5 5/","CF 6 6/","CF 7 7/","CF 8 8/"]
[1,"030101","APURÍMAC","MP DE ABANCAY","General","Cumple","No Cumple","No Cumple","No Cumple","Cumple","Cumple","No aplica","No aplica",0.60000000000000009,"Desfavorable","No Cumple","Si Cumple"]
[2,"030201","APURÍMAC","MP DE ANDAHUAYLAS","General","Cumple","Cumple","Cumple","No Cumple","Cumple","Cumple","No aplica","No aplica",0.89999999999999991,"Favorable","No Cumple","Si Cumple"]
[3,"030601","APURÍMAC","MP DE CHINCHEROS","General","Cumple","Cumple","Cumple","Cumple","No Cumple","Cumple","No aplica","No aplica",0.8,"Favorable","No Cumple","Si Cumple"]
{"$rows_left_out":108}