{"text_format":"1","workbook":"xlsx","n_sheets":59,"sheets":["datos","MENÚ","LINEAMIENTOS GENERALES","CRITERIOS DE APLICACIÓN","1.DATOS GENERALES","2.TERRITORIO","3.POBLACIÓN AFECTADA","4.UNIDAD PRODUCTORA","5.OTROS AGENTES INVOLUCRADOS","6.PROBLEMA-OBJETIVO","7.HORIZONTE DE EVALUACIÓN","8.ANALISIS TÉCNICO","9.COSTOS ","10.EVALUACION SOCIAL","11.SOSTENIBILIDAD","12.GESTIÓN","13.IMPACTO AMBIENTAL","14.MATRIZ MARCO LOGICO","15.CONCLUS-RECOMEND","FIRMAS","PROTOCOLO FINAL","16.ANEXOS DE LA FICHA","UNIDAD HIDROGRÁFICA"," TIPO DE ECOSISTEMAS PRINCIPAL","TIPO DE ECOSISTEMA ASOCIADO","ZONAS PRIORIZADAS","ORIENTACIONES TERRITORIO","ESPECIFICACION TECNICA","INFORME TECNICO CyC DEL AGUA","INFORME DE COBERTURA VEGETAL","INFORME DE SUELOS","HERRAMIENTAS CLIMA Y PELI","ANALISIS DE RIESGO","MATRIZ DE COSTO ESPECIALISTA","MANEJO LOS ECOSIST. DE INTE.","FICHA GESTION","FORMATO DE INFORME","ESCALA","DOCUMENTOS DE TALLER","MÉTODO RAS","ARBOL","COMUNICACIÓN TÉCNICA","INFRAESTRUCTURA NATURAL","HORIZONTE","Hoja3","TAMAÑO","CRITERIOS DE LOCALIZACION","TECNOLOGIA","COSTOS UNITARIOS","RANGO REF.COSTOS (ECOSIS.ALTOA)","CRONOGRAMA","O&M","FLUJO DE COSTOS","SOLICITUD SEIA","ACCIONES DE RESILENCIA","ESTUDIOS ESPECIALIZADOS","DETALLE DEL COSTO TOTAL","Hoja1","Hoja2"],"not_rendered":{"charts":0,"images":36,"macros":1,"external_links":15,"defined_names":4555,"comments":0,"pivot_tables":0},"unopened":[],"bounds":{"document_bytes":16777216,"sheet_cells":100000,"rows_first":2000,"rows_last":500,"rows_between":2000,"halvings":0,"cell_chars":16384,"cell_head_chars":4096},"cells_cut":0,"cells_raw":0,"read":"whole","date_system":"1900"}

{"sheet":"datos","index":0,"n_rows":282,"n_cols":28,"rows_kept":282,"cut":false,"hidden":true,"merged":[[240,1,241,1],[245,1,245,2],[77,1,77,2],[86,1,86,2],[105,1,105,2],[124,1,124,2],[217,1,217,2],[225,1,230,1],[49,1,49,2],[18,1,18,2],[19,1,19,2],[20,1,20,2],[21,1,21,2],[22,1,22,2],[23,1,23,2],[24,1,24,2],[25,1,25,2],[27,1,27,2],[32,1,32,2],[47,1,47,2]]}
[]
[null,"2. NOMBRE DEL PROYECTO"]
[null,"Naturaleza de Intervención",null,null,"¿Existen antecedentes de ocurrencia en el área de estudio?","Si"]
[null,"Recuperación",null,null,null,"No"]
[null,"Objeto",null,null,"¿Existe información que indique futuros cambios en las características del peligro o los nuevos peligros?","Si"]
[null,"SERVICIO ECOSISTÉMICO DE REGULACIÓN HÍDRICA",null,null,null,"No"]
[]
[]
[]
[]
[null,null,null,null,"AFIRMADO",null,"BUENO","A PIE","GOBIERNO LOCAL",null,"LOCAL","BENEFICIARIO"]
[null,null,null,null,"ASFALTADO",null,"REGULAR","ASEMILA","GOBIERNO REGIONAL",null,"NACIONAL","COOPERANTE"]
[null,null,null,null,"CAMINOS DE HERRADURA",null,"MALO","AUTO","POBLACIÓN",null,"REGIONAL","OPONENTE"]
[null,null,null,null,"CARRETERA",null,null,"BUS INTERPROVINCIAL","SECTOR",null,"OTROS","PERJUDICADO"]
[null,null,null,null,"SIN VÍA",null,null,"CAMIÓN","OTRO"]
[null,null,null,null,"TROCHA CARROZABLE",null,null,"CAMIONETA"]
[null,null,null,null,null,null,null,"VEHÍCULO MENOR"]
[null,"3. RESPONSABILIDAD FUNCIONAL"]
[null,"3.1. FUNCIÓN:"]
[null,"Función 17: Ambiente."]
[null,"3.2. DIVISIÓN FUNCIONAL:",null,null,"M","Superficie reforestada "]
[null,"División Funcional 054: Desarrollo estratégico conservación y aprovechamiento sostenible del patrimonio natural.",null,null,"M2","Superficie revegetada"]
[null,"3.3. GRUPO FUNCIONAL:",null,null,"M3","Superficie con suelos retenidos o recuperados"]
[null,"Grupo Funcional 0120: Gestión integrada y sostenible de los ecosistemas.",null,null,"KM","Excluidores con materiales naturales"]
[null,"3.4. SECTOR RESPONSABLE:",null,null,"HA","Zanjas de infiltración con materiales naturales"]
[null," Sector Ambiente.",null,null,"LITROS/SEGUNDO","Terrazas de formación de suelos con materiales naturales"]
[null,null,null,null,"SET","Cochas o Qochas."]
[null,"ECOSISTEMAS DE INTERÉS HÍDRICO PRINCIPAL",null,"e","NÚMERO ","Infraestructura hídrica en amunas (estructura de captación, dique de derivación, canal amunador)","Infraestructura hídrica en amunas (estructura de captación, dique de derivación, canal amunador)"]
[null,null,null,null,"UNIDAD","Barreras Rompe vientos ","Diques o reservorios de retención de aguas rústicas"]
[null,"BOFEDAL",null,null,"SERVICIO","Barreras corta fuegos"]
[null,"HUMEDALES Y LAGUNAS ALTOANDINAS",null,null,null,"Atrapanieblas","Cochas o Qochas."]
[null,null,null,null,null,"Canales de mamanteo mejorados con materiales naturales","Diques o reservorios de retención de aguas rústicas"]
[null,"ECOSISTEMA DE INTERÉS HÍDRICO ASOCIADO",null,null,null,"Superficie de cobertura vegetal para proteger canales de mamanteo"]
["PÁRAMO","PÁRAMO",null,null,null,"Cercos vivos o barreras vivas"]
["PAJONAL DE PUNA SECA","PAJONAL DE PUNA HÚMEDA",null,null,null,"Diques de control de cárcavas con materiales naturales"]
["PAJONAL DE PUNA HÚMEDA","JALCA",null,null,null,"Diques o reservorios de retención de aguas rústicas"]
["JALCA","MATORRAL DE PUNA SECA",null,null,null,"Superficie de cobertura vegetal para fitoremediación de aguas"]
["MATORRAL DE PUNA SECA","BOSQUE RELICTO ALTOANDINO (QUEÑOAL Y OTROS)",null,null,null,"Barreras Rompe vientos "]
["BOSQUE RELICTO ALTOANDINO (QUENOAL Y OTROS)","BOSQUE RELICTO MONTANO DE VERTIENTE OCCIDENTAL","LOS HUMEDALES RECONOCIDOS COMO DE IMPORTANCIA INTERNACIONAL O SITIOS RAMSAR",null,null,"Barreras corta fuegos"]
["BOSQUE RELICTO MONTANO DE VERTIENTE OCCIDENTAL","BOSQUE RELICTO MESOANDINO","ÁREAS DE CONSERVACIÓN AMBIENTAL",null,null,"Atrapanieblas"]
["BOSQUE RELICTO MESOANDINO","BOSQUE ESTACIONALMENTE SECO  INTERANDINO (MARAÑÓN, MANTARO, PAMPAS Y APURÍMAC)","ZONAS DE PROTECCIÓN Y CONSERVACIÓN ECOLÓGICA Y ZONAS DE RECUPERACIÓN IDENTIFICADAS EN EL PROCESO DE ZONIFICACIÓN ECOLÓGICA ECONÓMICA APROBADOS POR EL MINAM",null,null,"Canales de mamanteo mejorados con materiales naturales"]
["BOSQUE ESTACIONALMENTE SECO  INTERANDINO (MARAÑON, MANTARO, PAMPAS Y APURIMAC)","MATORRAL ANDINO","ZONAS PRIORIZADAS POR LOS SISTEMAS REGIONALES DE CONSERVACIÓN",null,null,"Superficie de cobertura vegetal para proteger canales de mamanteo"]
["MATORRAL ANDINO","USO PRIORITARIO","ÁREAS NATURALES PROYEGIDAS DE ADMINISTRACIÓN NACIONAL O ÁREAS DE CONSERVACIÓN REGIONAL, INCLUYENDO ZONAS DE AMORTIGUAMIENTO",null,null,"Cercos vivos o barreras vivas"]
[null,null,"ZONAS DE RECUPERACIÓN IDENTIFICADAS EN LOS PROCESOS DE ZONIFICACIÓN ECOLÓGICA ECONÓMICA APROBADAS POR EL MINAM",null,null,"Diques de control de cárcavas con materiales naturales"]
[null,"USO POBLACIONAL","ECOSISTEMAS DEGRADADOS QUE NO ESTÉN EN LOS ANTERIORES GRUPOS Y QUE DEMUESTREN SU RELEVANCIA ECONÓMICA, SOCIAL, CULTURAL O SI SON ÚNICOS EN EL PAÍS",null,null,"Diques o reservorios de retención de aguas rústicas"]
[null,"USO AGRARIO",null,null,null,"Superficie de cobertura vegetal para fitoremediación de aguas"]
[null,null,null,null,null,"Infraestructura física"]
[null,"II. IDENTIFICACIÓN",null,null,null,"Cercos "]
[null,null,null,null,null,"Canales de mamanteo mejorados e impermeabilizados"]
[null,"2.1 CAUSAS DIRECTAS",null,null,null,"Muros rústicos de sostenimiento"]
[null,null,null,null,null,"Diques de control de cárcavas"]
[null,"DISMINUCIÓN DE CAPACIDAD DE ALMACENAMIENTO DEL AGUA EN EL ECOSISTEMA PRINCIPAL",null,null,null,"Diques o reservorios de retención de agua"]
[null,null,null,null,null,"Sistemas de riego asociados con los activos de infraestructura natural"]
[null,"DISMINUCIÓN DE LA CAPACIDAD DE INFILTRACIÓN DEL AGUA EN EL ECOSISTEMA ASOCIADO",null,null,null,"Muros de protección "]
[]
[null,"INADECUADA GESTIÓN DEL SERVICIO ECOSISTÉMICO DE REGULACIÓN HÍDRICA"]
[]
[]
[null,"2.1 CAUSAS INDIRECTAS"]
[]
[null,"ALTERACIÓN DE LA COBERTURA VEGETAL NATIVA",null,{"$f":"IF('[5]FICHA TECNICA SERH'!B169=\"\",\"\",\"CAUSA_DIRECTA_1\")","v":"CAUSA_DIRECTA_1"},null,"Muros de protección "]
[null,null,null,{"$f":"IF('[5]FICHA TECNICA SERH'!B169=\"\",\"\",\"CAUSA_DIRECTA_1.2\")","v":"CAUSA_DIRECTA_1.2"},null,"Puesto de vigilancia"]
[null,"ALTERACIÓN DE LAS CARACTERÍSTICAS DE LA TURBA ",null,{"$f":"IF('[5]FICHA TECNICA SERH'!B169=\"\",\"\",\"CAUSA_DIRECTA_1.3\")","v":"CAUSA_DIRECTA_1.3"},null,"Vías y caminos de acceso"]
[null,null,null,{"$f":"IF('[5]FICHA TECNICA SERH'!B173=\"\",\"\",\"CAUSA_DIRECTA_2.1\")","v":"CAUSA_DIRECTA_2.1"},null,"Cercos de seguridad"]
[null,"ALTERACIÓN DE LA CALIDAD DEL AGUA SUPERFICIAL",null,{"$f":"IF('[5]FICHA TECNICA SERH'!B173=\"\",\"\",\"CAUSA_DIRECTA_2.2\")","v":"CAUSA_DIRECTA_2.2"},null,"Camioneta"]
[null,null,null,{"$f":"IF('[5]FICHA TECNICA SERH'!B173=\"\",\"\",\"CAUSA_DIRECTA_2.3\")","v":"CAUSA_DIRECTA_2.3"},null,"Bote"]
[null,"DISMINUCIÓN DE LA COBERTURA VEGETAL NATIVA",null,{"$f":"IF('[5]FICHA TECNICA SERH'!B176=\"\",\"\",\"CAUSA_DIRECTA_3.1\")","v":"CAUSA_DIRECTA_3.1"},null,"Canoa/ peque peque"]
[null,null,null,{"$f":"IF('[5]FICHA TECNICA SERH'!B176=\"\",\"\",\"CAUSA_DIRECTA_3.2\")","v":"CAUSA_DIRECTA_3.2"},null,"Deslizador"]
[null,"ALTERACIÓN DE LAS CARACTERÍSTICAS DEL SUELO",null,null,null,"Motocicleta"]
[null,null,null,null,null,"Drones"]
[null,"CAMBIO EN EL RÉGIMEN DE PRECIPITACIONES Y TEMPERATURAS",null,null,null,"Dendrómetros"]
[null,null,null,null,null,"Cámaras trampa"]
[null,"INADECUADO MANEJO DE LOS ECOSISTEMAS DE INTERÉS HÍDRICO",null,null,null,"Estación meteorológica"]
[null,null,null,null,null,"Estación hidrológica"]
[null,"INADECUADA CAPACIDAD DE GESTIÓN DE LOS ECOSISTEMAS DE INTERÉS HÍDRICO",null,null,null,"Antenas de transmisión"]
[null,null,null,null,null,"Paneles Solares"]
[null,null,null,null,null,"Estación biológica"]
[null,"2.2 EFECTOS DIRECTOS",null,null,null,"Camión Cisterna "]
[null,null,null,null,null,"Cuatrimotos "]
[null,null,null,null,null,"Muelles"]
[null,"MENOR DISPONIBILIDAD DEL SERVICIO ECOSISTÉMICOS DE PROVISIÓN DEL RECURSO HÍDRICO",null,null,"Alto","Bajo"]
[null,null,null,null,"Medio","Moderado "]
[null,"INCREMENTO EN EL DETERIORO DE LOS ECOSISTEMAS",null,null,"Bajo","Mayor"]
[]
[]
[]
[null,"2.2 EFECTOS INDIRECTOS"]
[]
[]
[null,"DISMINUCIÓN DE LA OFERTA DEL AGUA POTABLE PARA USO POBLACIONAL",null,{"$f":"IF('[5]FICHA TECNICA SERH'!B183=\"\",\"\",\"EI_1.1\")","v":"EI_1.1"}]
[]
[null,"DISMINUCIÓN DE LA OFERTA DEL AGUA PARA USO AGROPECUARIO",null,{"$f":"IF('[5]FICHA TECNICA SERH'!B183=\"\",\"\",\"EI_1.2\")","v":"EI_1.2"}]
[]
[null,"DISMINUCIÓN DE LA OFERTA DEL AGUA PARA USO ENERGÉTICO",null,{"$f":"IF('[5]FICHA TECNICA SERH'!B185=\"\",\"\",\"EI_1.3\")","v":"EI_1.3"}]
[]
[null,"DISMINUCIÓN DEL SERVICIO ECOSISTÉMICO DE PROVISIÓN DE LOS RECURSOS GENÉTICOS",null,{"$f":"IF('[5]FICHA TECNICA SERH'!B186=\"\",\"\",\"EI_2.1\")","v":"EI_2.1"}]
[]
[null,"DISMINUCIÓN DEL SERVICIO ECOSISTÉMICO DE PROVISIÓN DE COMBUSTIBLE",null,{"$f":"IF('[5]FICHA TECNICA SERH'!B186=\"\",\"\",\"EI_2.2\")","v":"EI_2.2"}]
[]
[null,"DISMINUCIÓN DEL SERVICIO ECOSISTÉMICO DE PROVISIÓN DE FORRAJE",null,{"$f":"IF('[5]FICHA TECNICA SERH'!B186=\"\",\"\",\"EI_2.3\")","v":"EI_2.3"}]
[]
[null,"DISMINUCIÓN DEL SERVICIO ECOSISTÉMICO DE PROVISIÓN DE MEDICINAS NATURALES",null,{"$f":"IF('[5]FICHA TECNICA SERH'!B186=\"\",\"\",\"EI_3.1\")","v":"EI_3.1"}]
[]
[null,"DISMINUCIÓN DEL SERVICIO ECOSISTÉMICO DE PROVISIÓN DE PRODUCTOS BIOQUÍMICOS",null,{"$f":"IF('[5]FICHA TECNICA SERH'!B186=\"\",\"\",\"EI_3.2\")","v":"EI_3.2"}]
[]
[null,"2.3 DEFINICIÓN DE LOS OBJETIVOS DEL PROYECTO"]
[]
[null,"Medios Fundamentales","PRODUCTO"]
[1,"RECUPERACIÓN DE LA COBERTURA VEGETAL NATIVA DEL ECOSISTEMA PRINCIPAL","HECTÁREAS DE COBERTURA VEGETAL INCREMENTADAS DEL ECOSISTEMA PRINCIPAL"]
[2,"RECUPERACIÓN DE LAS CARACTERÍSTICAS DE LA TURBA DEL ECOSISTEMA PRINCIPAL","HECTÁREAS DE LA ESTRUCTURA DE LA TURBA RECUPERADA DEL ECOSISTEMA PRINCIPAL"]
[3,"RECUPERACIÓN DE LA CALIDAD DE AGUA SUPERFICIALES","METROS CUADRADOS DE ESPEJO DE AGUA RECUPERADO"]
[4,"RECUPERACIÓN DE LA COBERTURA VEGETAL DE LOS ECOSISTEMAS ASOCIADOS","HECTÁREAS DE COBERTURA VEGETAL INCREMENTADAS DE LOS ECOSISTEMAS ASOCIADOS"]
[5,"RECUPERACIÓN DE LAS CARACTERÍSTICAS DEL SUELO DEL ECOSISTEMA ASOCIADO","HECTÁREAS DE LA ESTRUCTURA DEL SUELO RECUPERADA DE LOS ECOSISTEMAS ASOCIADOS"]
[6,"ADAPTACIÓN A LOS REGÍMENES DE PRECIPITACIÓN Y TEMPERATURAS","NÚMERO DE MEDIDAS DE ADAPTACIÓN AL RÉGIMEN DE PRECIPITACIONES Y TEMPERATURAS"]
[7,"ADECUADAS PRÁCTICAS DEL MANEJO DEL ECOSISTEMA","POBLADORES CON ADECUADAS CAPACIDADES EN PRÁCTICAS DE MANEJO DE LOS ECOSISTEMAS DE INTERÉS HÍDRICO"]
[8,"ADECUADAS CAPACIDADES DE LAS ENTIDADES A CARGO DE LA GESTIÓN DEL ECOSISTEMA","N° DE ÁREAS U ÓRGANOS ENCARGADOS DE LA GESTIÓN DEL ECOSISTEMA DE INTERÉS HÍDRICO CON ADECUADAS CAPACIDADES EN GESTIÓN DEL ECOSISTEMA"]
[]
[null,"FUENTES DE VERIFICACIÓN"]
[null,"FOTO SATELITAL"]
[null,"INFORME DE MONITOREO EN CAMPO"]
[null,"ACTA DE TALLERES CON ACTORES CLAVES"]
[null,"DOCUMENTOS DE GESTIÓN"]
[]
[]
[null,"2.4 MEDIOS FUNDAMENTALES"]
[]
[]
[]
[null,"MEDIOS FUNDAMENTALES","ACCIONES","ITEM",null,null,null,null,"TIPO DE ITEM"]
[1,{"$f":"B109","v":"RECUPERACIÓN DE LA COBERTURA VEGETAL NATIVA DEL ECOSISTEMA PRINCIPAL"},"REFORESTACIÓN CON ESPECIES NATIVAS","INFRAESTRUCTURA NATURAL",null,"ACCION1.1",null,null,"INFRAESTRUCTURA NATURAL"]
[]
[null,null,"REVEGETACIÓN CON ESPECIES NATIVAS","INFRAESTRUCTURA NATURAL",null,"ACCION1.2",null,null,"INTANGIBLE"]
[]
[null,null,"INSTALACIÓN DE CERCOS EXCLUIDORES","INFRAESTRUCTURA NATURAL",null,"ACCION1.3"]
[]
[2,{"$f":"B110","v":"RECUPERACIÓN DE LAS CARACTERÍSTICAS DE LA TURBA DEL ECOSISTEMA PRINCIPAL"},"CONTROL DE CÁRCAVAS","INFRAESTRUCTURA NATURAL",null,"ACCION2.1"]
[]
[null,null,"ENRIQUECIMIENTO DE SUELOS","INFRAESTRUCTURA NATURAL",null,"ACCION2.2"]
[]
[null,null,"CONSTRUCCIÓN DE TERRAZAS DE FORMACIÓN DE SUELOS","INFRAESTRUCTURA NATURAL",null,"ACCION2.3"]
[]
[3,{"$f":"B111","v":"RECUPERACIÓN DE LA CALIDAD DE AGUA SUPERFICIALES"},"FITORREMEDIACIÓN DE AGUAS","INFRAESTRUCTURA NATURAL",null,"ACCION3.1"]
[]
[null,null,"EXTRACCIÓN DE VEGETACIÓN ACUÁTICA ","INFRAESTRUCTURA NATURAL",null,"ACCION3.2",null,null,"DOCUMENTO"]
[]
[4,{"$f":"B112","v":"RECUPERACIÓN DE LA COBERTURA VEGETAL DE LOS ECOSISTEMAS ASOCIADOS"},"REFORESTACIÓN CON ESPECIES NATIVAS","INFRAESTRUCTURA NATURAL",null,"ACCION4.1",null,null,"EVENTO"]
[]
[null,null,"REVEGETACIÓN CON ESPECIES NATIVAS","INFRAESTRUCTURA NATURAL",null,"ACCION4.2",null,null,"HA"]
[]
[null,null,"INSTALACIÓN DE CERCOS EXCLUIDORES","INFRAESTRUCTURA NATURAL",null,"ACCION4.3"]
[]
[5,{"$f":"B113","v":"RECUPERACIÓN DE LAS CARACTERÍSTICAS DEL SUELO DEL ECOSISTEMA ASOCIADO"},"CONTROL DE CÁRCAVAS","INFRAESTRUCTURA NATURAL",null,"ACCION5.1",null,null,"HORAS HOMBRE"]
[]
[null,null,"ENRIQUECIMIENTO DE SUELOS","INFRAESTRUCTURA NATURAL"]
[]
[null,null,"CONSTRUCCIÓN DE TERRAZAS DE FORMACIÓN DE SUELOS","INFRAESTRUCTURA NATURAL"]
[]
[6,{"$f":"B114","v":"ADAPTACIÓN A LOS REGÍMENES DE PRECIPITACIÓN Y TEMPERATURAS"},"REPARACIÓN DEL CANAL AMUNADOR","INFRAESTRUCTURA NATURAL"]
[]
[null,null,"REPARACIÓN DEL CANAL DE MAMANTEO","INFRAESTRUCTURA NATURAL"]
[]
[null,null,"CONSTRUCCIÓN DE ZANJAS DE INFILTRACIÓN","INFRAESTRUCTURA NATURAL"]
[]
[null,null,"INSTALACIÓN DE QOCHAS","INFRAESTRUCTURA NATURAL"]
[]
[7,{"$f":"B115","v":"ADECUADAS PRÁCTICAS DEL MANEJO DEL ECOSISTEMA"},"CAPACITACIÓN EN GESTIÓN INTEGRADA DE RECURSOS HÍDRICOS CON ENFOQUE DE CUENCA","INTANGIBLE",null,"ACCION5.2",null,null,"M2"]
[]
[null,null,"ASISTENCIA TÉCNICA EN EL MANEJO DE ECOSISTEMAS DE INTERÉS HÍDRICO","INTANGIBLE",null,"ACCION5.3"]
[]
[null,null,"CAPACITACIÓN EN BUENAS PRÁCTICAS PARA LA ADAPTACIÓN AL CAMBIO CLIMÁTICO Y GESTIÓN DE RIESGOS","INTANGIBLE"]
[]
[null,null,"SENSIBILIZACIÓN RELACIONADA A LA RECUPERACIÓN DEL SERVICIO ECOSISTÉMICO DE REGULACIÓN HÍDRICA","INTANGIBLE",null,"ACCION5.4"]
[]
[null,null,"INTERCAMBIO DE EXPERIENCIAS RELACIONADAS A LA RECUPERACIÓN DEL SERVICIO ECOSISTÉMICO DE REGULACIÓN HÍDRICA","INTANGIBLE",null,"ACCION5.5"]
[]
[8,{"$f":"B116","v":"ADECUADAS CAPACIDADES DE LAS ENTIDADES A CARGO DE LA GESTIÓN DEL ECOSISTEMA"},"CAPACITACIÓN A FUNCIONARIOS PÚBLICOS SOBRE LA GESTIÓN INTEGRADA DEL RECURSO HÍDRICO CON ENFOQUE DE CUENCA","INTANGIBLE",null,"ACCION6.1",null,null,"M3"]
[]
[null,null,"CAPACITACIÓN A FUNCIONARIOS PÚBLICOS SOBRE LAS MEDIDAS DE ADAPTACIÓN EN UN CONTEXTO DE CAMBIO CLIMÁTICO EN LA GESTIÓN INTEGRADA DE LOS RECURSOS HÍDRICOS","INTANGIBLE",null,"ACCION6.2",null,null,"MATERIALES"]
[]
[null,null,"DESARROLLO DE CAPACIDADES PARA EL MONITOREO Y SEGUIMIENTO DE LOS ECOSISTEMAS DE INTERÉS HÍDRICO Y EL SERVICIO ECOSISTÉMICO DE REGULACIÓN HÍDRICA","INTANGIBLE",null,"ACCION6.3"]
[]
[null,null,"INTERCAMBIO DE EXPERIENCIAS SOBRE LA GESTIÓN INTEGRADA DEL RECURSO HÍDRICO CON ENFOQUE DE CUENCA","INTANGIBLE",null,"ACCION6.4"]
[]
[]
[]
[]
[null,"ACCIONES"]
[null,{"$f":"C130","v":"REFORESTACIÓN CON ESPECIES NATIVAS"},{"$f":"C132","v":"REVEGETACIÓN CON ESPECIES NATIVAS"},{"$f":"C134","v":"INSTALACIÓN DE CERCOS EXCLUIDORES"},{"$f":"C136","v":"CONTROL DE CÁRCAVAS"},{"$f":"C138","v":"ENRIQUECIMIENTO DE SUELOS"},{"$f":"C140","v":"CONSTRUCCIÓN DE TERRAZAS DE FORMACIÓN DE SUELOS"},{"$f":"C142","v":"FITORREMEDIACIÓN DE AGUAS"},{"$f":"C144","v":"EXTRACCIÓN DE VEGETACIÓN ACUÁTICA "},{"$f":"C146","v":"REFORESTACIÓN CON ESPECIES NATIVAS"},{"$f":"C148","v":"REVEGETACIÓN CON ESPECIES NATIVAS"},{"$f":"C150","v":"INSTALACIÓN DE CERCOS EXCLUIDORES"},{"$f":"C152","v":"CONTROL DE CÁRCAVAS"},{"$f":"C154","v":"ENRIQUECIMIENTO DE SUELOS"},{"$f":"C156","v":"CONSTRUCCIÓN DE TERRAZAS DE FORMACIÓN DE SUELOS"},{"$f":"C158","v":"REPARACIÓN DEL CANAL AMUNADOR"},{"$f":"C160","v":"REPARACIÓN DEL CANAL DE MAMANTEO"},{"$f":"C162","v":"CONSTRUCCIÓN DE ZANJAS DE INFILTRACIÓN"},{"$f":"C164","v":"INSTALACIÓN DE QOCHAS"},"CAPACITACIÓN EN GESTIÓN INTEGRADA DE RECURSOS HÍDRICOS CON ENFOQUE DE CUENCA"," ",{"$f":"C170","v":"CAPACITACIÓN EN BUENAS PRÁCTICAS PARA LA ADAPTACIÓN AL CAMBIO CLIMÁTICO Y GESTIÓN DE RIESGOS"},{"$f":"C172","v":"SENSIBILIZACIÓN RELACIONADA A LA RECUPERACIÓN DEL SERVICIO ECOSISTÉMICO DE REGULACIÓN HÍDRICA"},{"$f":"C174","v":"INTERCAMBIO DE EXPERIENCIAS RELACIONADAS A LA RECUPERACIÓN DEL SERVICIO ECOSISTÉMICO DE REGULACIÓN HÍDRICA"},{"$f":"C176","v":"CAPACITACIÓN A FUNCIONARIOS PÚBLICOS SOBRE LA GESTIÓN INTEGRADA DEL RECURSO HÍDRICO CON ENFOQUE DE CUENCA"},{"$f":"C178","v":"CAPACITACIÓN A FUNCIONARIOS PÚBLICOS SOBRE LAS MEDIDAS DE ADAPTACIÓN EN UN CONTEXTO DE CAMBIO CLIMÁTICO EN LA GESTIÓN INTEGRADA DE LOS RECURSOS HÍDRICOS"},{"$f":"C180","v":"DESARROLLO DE CAPACIDADES PARA EL MONITOREO Y SEGUIMIENTO DE LOS ECOSISTEMAS DE INTERÉS HÍDRICO Y EL SERVICIO ECOSISTÉMICO DE REGULACIÓN HÍDRICA"},{"$f":"C182","v":"INTERCAMBIO DE EXPERIENCIAS SOBRE LA GESTIÓN INTEGRADA DEL RECURSO HÍDRICO CON ENFOQUE DE CUENCA"}]
[]
[null,"ACTIVIDADES"]
[null,"PLANIFICACIÓN DE ESPECIES A ADQUIRIR O PRODUCIR","SIEMBRA DE ESPECIES HERBÁCEAS SELECCIONADAS","TRAZO Y MARCACIÓN","INSTALACIÓN DE BARRERAS VIVAS","DESHIERBO","TRAZO Y MARCACIÓN","SELECCIÓN DE PLANTAS PARA LA FITORREMEDIACIÓN","CONTROL FÍSICO DE MALEZA ACUÁTICA","PLANIFICACIÓN DE ESPECIES A ADQUIRIR O PRODUCIR","SIEMBRA DE ESPECIES HERBÁCEAS SELECCIONADAS","TRAZO Y MARCACIÓN","INSTALACIÓN DE BARRERAS VIVAS","DESHIERBO","TRAZO Y MARCACIÓN","CONSTRUCCIÓN DE DIQUE Y ESTRUCTURA DE CAPTACIÓN","DESCOLMATACIÓN DE CANALES","TRAZO, NIVELES Y REPLANTE PRELIMINAR","CONSTRUCCIÓN DE DIQUES","COORDINACIÓN CON ORGANIZACIONES Y COMITÉS DE LA COMUNIDAD EXISTENTE","COORDINACIÓN CON ORGANIZACIONES Y COMITÉS DE LA COMUNIDAD","TALLERES DE CAPACITACIÓN EN ADAPTACIÓN AL CAMBIO CLIMÁTICO","CAMPAÑAS DE SENSIBILIZACIÓN","REALIZACIÓN DE PASANTÍAS","TALLERES DE CAPACITACIÓN SOBRE GESTIÓN DEL ECOSISTEMA","TALLERES DE CAPACITACIÓN SOBRE CAMBIO CLIMÁTICO","TALLERES DE CAPACITACIÓN SOBRE MONITOREO Y SEGUIMIENTO","REALIZACIÓN DE PASANTÍAS"]
[null,null,null,null,null,null,"REMOCIÓN DE TIERRA FÉRTIL",null,null,null,null,null,null,null,"REMOCIÓN DE TIERRA FÉRTIL",null,null,null,null,null,null,null,null,null,{"$f":"N174","v":0}]
[null,"IMPLEMENTACIÓN DE VIVEROS FORESTALES","LABORES CULTURALES A ESPECIES HERBÁCEAS","APERTURA DE HOYOS","CONSTRUCCIÓN DE DIQUES","ABONAMIENTO POR FUENTES MINERALES","COMPACTACIÓN DEL SUELO DE LA TERRAZA","SEMBRADO DE PLANTAS ACUÁTICAS SOBRE ESTRUCTURAS FLOTANTES",null,"IMPLEMENTACIÓN DE VIVEROS FORESTALES","LABORES CULTURALES A ESPECIES HERBÁCEAS","APERTURA DE HOYOS","CONSTRUCCIÓN DE DIQUES","ABONAMIENTO POR FUENTES MINERALES","COMPACTACIÓN DEL SUELO DE LA TERRAZA","MEJORAMIENTO DEL CANAL AMUNADOR","RECONSTRUCCIÓN E IMPLEMENTACIÓN DE CANALES DE MAMANTEO","EXCAVACIÓN DE ZANJAS DE INFILTRACIÓN",null,"TALLERES DE CAPACITACIÓN A ORGANIZACIONES Y COMITÉS DE LA COMUNIDAD EXISTENTE","TALLERES DE CAPACITACIÓN A ORGANIZACIONES Y COMITÉS DE LA COMUNIDAD EXISTENTE"]
[null,null,null,null,null,null,"EMPAREJAMIENTO DE LA TERRAZA",null,null,null,null,null,null,null,"EMPAREJAMIENTO DE LA TERRAZA"]
[null,"LABORES CULTURALES EN PRODUCCIÓN DE PLANTONES",null,"TRASLADO DE PLANTADO DE POSTES",null,"ABONAMIENTO ORGÁNICO DEL ÁREA",null,null,null,"LABORES CULTURALES EN PRODUCCIÓN DE PLANTONES",null,"TRASLADO DE PLANTADO DE POSTES",null,"ABONAMIENTO ORGÁNICO DEL ÁREA",null,"INSTALACIÓN DE ÁREA DE PROTECCIÓN","INSTALACIÓN DE MEDIDAS DE PROTECCIÓN","COMPACTACIÓN DEL TERRENO"]
[]
[null,"PLANTACIÓN PROPIAMENTE DICHA",null,null,null,"INSTALACIÓN DE VEGETACIÓN PARA ENRIQUECIMIENTO DEL SUELO",null,null,null,"PLANTACIÓN PROPIAMENTE DICHA",null,null,null,"INSTALACIÓN DE VEGETACIÓN PARA ENRIQUECIMIENTO DEL SUELO",null,null,"EMPAREJAMIENTO DE LA TERRAZA"]
[]
[null,"LABORES CULTURALES A PLANTONES INSTALADOS",null,null,null,null,null,null,null,"LABORES CULTURALES A PLANTONES INSTALADOS",null,null,null,null,null,null,"MANTENIMIENTO DE TERRAZA ANDINA"]
[]
[]
[null,"UNIDAD DE MEDIDA"]
[null,"UNIDAD","HA","ML","HA","M2","ML","UNIDAD","HA","UNIDAD","HA","ML","HA","M2","ML","UNIDAD","UNIDAD","M2","UNIDAD","HORAS HOMBRE","HORAS HOMBRE","TALLER","TALLER","PASANTÍA","TALLER","TALLER","TALLER","PASANTÍA"]
[null,"M2","HORAS HOMBRE","UNIDAD","UNIDAD","M2","HA","HA",null,"M2","HORAS HOMBRE","UNIDAD","UNIDAD","M2","HA","UNIDAD","UNIDAD","ML",null,"TALLER","TALLER"]
[null,"HORAS HOMBRE",null,"ML",null,"M2","HA",null,null,"HORAS HOMBRE",null,"ML",null,"M2","HA","HA","HA","HA"]
[null,"HA",null,null,null,"HA","HA",null,null,"HA",null,null,null,"HA","HA"]
[null,"HORAS HOMBRE",null,null,null,null,null,null,null,"HORAS HOMBRE"]
[]
[null,"ANÁLISIS TÉCNICO"]
[null,"LOCALIZACIÓN"]
[null,"TECNOLOGÍA"]
[null,"TAMAÑO"]
[]
[]
[]
[]
[]
[null,"CRONOGRAMA DE EJECUCIÓN"]
[null,"MES"]
[null,"BIMESTRE"]
[null,"TRIMESTRE"]
[null,"SEMESTRE"]
[null,"AÑO"]
[]
[null,"SERVICIO ECOSISTÉMICO RELACIONADO ","BENEFICIO SOCIAL RELACIONADO"]
[null,"SERVICIOS ECOSISTÉMICOS DE PROVISIÓN.","INCREMENTO DE DOTACIÓN DE AGUA PARA CONSUMO HUMANO"]
[null,null,"INCREMENTO DE DOTACIÓN DE AGUA PARA RIEGO"]
[null,null,"INCREMENTO DE DOTACIÓN DE AGUA PARA ENERGÍA"]
[null,null,"INCREMENTO DE DOTACIÓN DE ALIMENTOS"]
[null,null,"INCREMENTO DE BIOMASA FORRAJERA DE PASTIZAL"]
[null,null,"REPOBLAMIENTO DE ESPECIES DE FLORA Y FAUNA"]
[null,null,"MAYOR DISPONIBILIDAD DE AGUA SUPERFICIAL"]
[null,"SERVICIOS ECOSISTÉMICOS DE REGULACIÓN.","MAYOR RECARGA DEL SUBSUELO/ACUÍFERO"]
[null,null,"COSTOS EVITADOS EN EL TRATAMIENTO DE SEDIMENTOS EN AGUA CAPTADA POR UP DE AGUA POTABLE O AGUA PARA RIEGO."]
[null,null,"INCREMENTO DE SUELOS RECUPERADOS POR EROSIÓN"]
[null,null,"MENOS SEDIMENTOS EN EL AGUA"]
[null,null,"PROTECCIÓN LOCALIZADA ANTE POSIBLES AVENIDAS CON ARRASTRE DE SUELOS"]
[null,null,"COSTOS EVITADOS A LAS UP (ATENCIÓN DE EMERGENCIA REHABILITACIÓN RECONSTRUCCIÓN)"]
[null,null,"COSTOS EVITADOS (DIRECTOS E INDIRECTOS) A LOS USUARIOS DE LAS UP POR NO DISPONER DEL SERVICIO"]
[null,null,"COSTOS EVITADOS A LA POBLACIÓN (VIVIENDAS MEDIOS DE VIDA SALUD ENTRE OTROS)"]
[null,"SERVICIOS ECOSISTÉMICOS DE SOPORTE","FORMACIÓN O AMPLIACIÓN DE BOFEDALES"]
[null,null,"REVERDECIMIENTO Y CRECIMIENTO DE PASTIZALES"]
[null,"SERVICIOS ECOSISTÉMICOS CULTURALES","MEJORA DEL PAISAJE"]
[]
[]
[null,"MATRIZ DE MARCO LÓGICO"]
[null,"COMPONENTES","COMPONENTES"]
[null,"MEDIOAS DE VERIFICACIÓN","SUPUESTOS"]
[null,"INFORME DEL AREA RESPONSABLE DE LA EJECUCIÓN DEL PI. INFORMES DEL ÁREA RESPONSABLE DE LA RECUPERACIÓN DEL AREA DEGRADADA. INFORMES DE INSPECCIÓN Y FOTOS","NO EXISTEN MODIFICACIONES QUE VULNEREN LAS CONDICIONES ESPECIFICADAS EN LOS ESTÁNDARES TÉCNICOS DADOS POR EL SECTOR"]
[null,"INFORMES DE EJECUCIÓN DE LOS TALLERES DE CAPACITACIÓN AL PERSONAL MUNICIPAL ENCARGADO DE LA RECUPERACIÓN","LA POBLACIÓN PARTICIPA ACTIVAMENTE EN LAS ACCIONES DE SENSIBILIZACIÓN, ASISTENCIA TÉCNICA Y CAPACITACIÓN"]
[null,"INFORMES DE EJECUCIÓN DE LOS TALLERES DE CAPACITACIÓN A LA POBLACIÓN Y A LOS RECICLADORES","LAS AUTORIDADES PARTICIPAN ACTIVAMENTE EN LAS ACCIONES DE SENSIBILIZACIÓN, ASISTENCIA TÉCNICA Y CAPACITACIÓN"]
[null,"OTRO"]
[]
[]
[]
[null,"ACCIONES"]
[null,"MEDIOS DE VERIFICACIÓN"]
[null,"INFORME DEL ÁREA RESPONSABLE DE LA EJECUCIÓN DEL PROYECTO. INFORMES DE LA SUPERVISIÓN Y FOTOS. LIQUIDACIÓN TÉCNICO-FINANCIERA DE LA EJECUCIÓN. ACTA DE RECEPCIÓN Y TRANSPARENCIA"]
[null,"INFORMES DE EJECUCIÓN DE LOS TALLERES DE CAPACITACIÓN. CONTRATO DE LA CONSULTORA ENCARGADA DE LLEVAR A CABO LOS TALLERES"]
[null,"CONTRATO DE LA CONSULTORA ENCARGADA DE LA ELABORACIÓN DEL INSTRUMENTO DE SUPERVISIÓN Y MONITOREO (PLAN DE MONITOREO AMBIENTAL"]
[null,"OTRO"]
[]
[null,"RIESGO"]
[null,"OCURRENCIA","IMPACTO"]
[null,"BAJO","BAJA"]
[null,"MODERADO","MEDIA"]
[null,"MAYOR","ALTA"]
[]
[null,"MODALIDAD DE EJECUCIÓN"]
[null,"ADMINISTRACIÓN DIRECTA"]
[null,"ADMINISTRACIÓN INDIRECTA – POR CONTRATA"]
[null,"ADMINISTRACIÓN INDIRECTA – ASOCIACIÓN PÚBLICA PRIVADO (APP)"]
[null,"ADMINISTRACIÓN INDIRECTA – LEY 29230 (OBRAS POR IMPUESTOS)"]
[null,"ADMINISTRACIÓN INDIRECTA – NÚCLEO EJECUTOR"]
[null,"ADMINISTRACIÓN INDIRECTA – CONCURSO OFERTA"]
[]
[null,"FUENTES DE FINANCIAMIENTO"]
[null,"RECURSOS ORDINARIOS"]
[null,"RECURSOS DIRECTAMENTE RECAUDADOS"]
[null,"RECURSOS POR OPERACIONES OFICIALES DE CRÉDITO"]
[null,"DONACIONES Y TRANSFERENCIAS"]
[null,"RECURSOS DETERMINADOS"]

{"sheet":"MENÚ","index":1,"n_rows":0,"n_cols":0,"rows_kept":0,"cut":false,"hidden":false,"merged":[]}

{"sheet":"LINEAMIENTOS GENERALES","index":2,"n_rows":0,"n_cols":0,"rows_kept":0,"cut":false,"hidden":false,"merged":[]}

{"sheet":"CRITERIOS DE APLICACIÓN","index":3,"n_rows":0,"n_cols":0,"rows_kept":0,"cut":false,"hidden":false,"merged":[]}

{"sheet":"1.DATOS GENERALES","index":4,"n_rows":136,"n_cols":18,"rows_kept":136,"cut":false,"hidden":false,"merged":[[127,3,127,12],[127,14,127,28],[129,3,129,12],[129,14,129,28],[12,1,12,14],[121,3,121,12],[121,14,121,28],[123,3,123,12],[123,14,123,28],[125,3,125,12],[125,14,125,28],[24,2,24,11],[24,13,24,15],[24,17,24,19],[24,21,24,23],[24,25,24,27],[84,3,84,28],[51,3,51,12],[53,3,53,12],[20,2,20,11],[20,13,20,27],[22,2,22,11],[22,13,22,15],[22,17,22,19],[22,21,22,23],[22,25,22,27],[51,14,51,28],[53,14,53,28],[55,14,55,28],[58,3,58,12],[26,2,26,27],[30,2,30,27],[37,13,37,27],[37,2,37,11],[28,2,28,11],[28,13,28,27],[39,2,39,11],[39,13,39,27],[41,2,42,27],[49,14,49,28],[49,3,49,12],[60,3,60,12],[62,3,62,12],[64,3,64,12],[72,3,72,28],[55,3,55,12],[60,15,60,22],[74,14,74,28],[74,3,74,12],[76,14,76,28],[78,14,78,28],[80,14,80,28],[82,14,82,28],[76,3,76,12],[78,3,78,12],[80,3,80,12],[82,3,82,12],[86,14,86,28],[88,14,88,28],[86,3,86,12],[88,3,88,12],[92,14,92,28],[92,3,92,12],[90,3,90,20],[94,3,94,28],[96,3,96,12],[96,14,96,28],[98,3,98,12],[98,14,98,28],[100,3,100,12],[100,14,100,28],[102,3,102,12],[102,14,102,28],[106,14,106,28],[106,3,106,12],[104,3,104,17],[115,3,115,12],[115,14,115,28],[117,3,117,12],[117,14,117,28],[119,3,119,12],[119,14,119,28],[131,3,131,12],[131,14,131,28],[135,3,135,12],[135,14,135,28],[133,3,133,12],[133,15,133,16],[133,18,133,19]]}
[]
[]
[]
[]
[]
[]
[]
[]
[]
[]
[]
[]
[null,"SECCIÓN N° 1: DATOS GENERALES DEL PROYECTO"]
[]
[]
[]
[]
[]
[]
[]
[null,null,"Servicios públicos con brecha identificada y priorizada",null,null,null,null,null,null,null,null,null,null,"SERVICIOS  ECOSISTÉMICOS DE REGULACIÓN HÍDRICA"]
[]
[null,null,"Nombre del Indicador de brecha de acceso a servicios",null,null,null,null,null,null,null,null,null,null,"Unidad de medida"]
[]
[null,null,"% DE SUPERFICIE DE ECOSISTEMAS DEGRADADOS QUE BRINDAN SERVICIOS ECOSISTÉMICOS QUE REQUIEREN DE RECUPERACIÓN",null,null,null,null,null,null,null,null,null,null,"Hectáreas"]
[]
[null,null,"Nota: Se puede incluir más de un servicio público con brecha y más de un indicador"]
[]
[null,null,"Contribución del Cierre de Brecha (Valor)",null,null,null,"Valor:"]
[]
[null,null,"Nota: Se refiere a la capacidad de producción que aporta el proyecto (incremental). Su estimación proviene de la diferencia entre la oferta con proyecto (tamaño) respecto a la oferta optimizada sin proyecto (cuando corresponda)."]
[]
[]
[]
[]
[]
[]
[null,null,"Naturaleza",null,null,null,null,null,null,null,null,null,null,"Objeto de intervención"]
[]
[null,null,"RECUPERACIÓN",null,null,null,null,null,null,null,null,null,null,"SERVICIO ECOSISTÉMICO DE REGULACIÓN HÍDRICA"]
[]
[null,null,{"$f":"CONCATENATE(C40,\" DE \",N40,\" EN LA MICROCUENCA \",T124,\",\",\" EN LA LOCALIDAD DE \",T122,\",\",\" DEL DISTRITO DE \",T120,\",\",\" DE LA PROVINCIA DE \",T118,\",\",\" DEL DEPARTAMENTO DE \",T116)","v":"RECUPERACIÓN DE SERVICIO ECOSISTÉMICO DE REGULACIÓN HÍDRICA EN LA MICROCUENCA , EN LA LOCALIDAD DE , DEL DISTRITO DE , DE LA PROVINCIA DE , DEL DEPARTAMENTO DE "}]
[]
[]
[]
[]
[]
[]
[]
[null,null,null,"Función",null,null,null,null,null,null,null,null,null,null,"17: AMBIENTE"]
[]
[null,null,null,"División funcional",null,null,null,null,null,null,null,null,null,null,"054: DESARROLLO ESTRATÉGICO, CONSERVACIÓN Y APROVECHAMIENTO SOSTENIBLE DEL PATRIMONIO NATURAL"]
[]
[null,null,null,"Grupo Funcional",null,null,null,null,null,null,null,null,null,null,"0120: GESTIÓN INTEGRADA Y SOSTENIBLE DE LOS ECOSISTEMAS."]
[]
[null,null,null,"Sector responsable",null,null,null,null,null,null,null,null,null,null,"AMBIENTE"]
[]
[]
[null,null,null,"¿El proyecto pertenece a un Programa de Inversión?",null,null,null,null,null,null,null,null,null,null,"SI",null,null,"NO"]
[]
[null,null,null,"En caso afirmativo, indique código del Programa de Inversión"]
[]
[]
[]
[]
[]
[]
[]
[]
[]
[]
[]
[null,null,null,"UNIDAD FORMULADORA  (UF DEL PROYECTO)"]
[]
[null,null,null,"Sector"]
[]
[null,null,null,"Pliego "]
[]
[null,null,null,"Nombre de la Uf designada por el Órgano Resolutivo"]
[]
[null,null,null,"Persona responsable de la UF"]
[]
[null,null,null,"  Persona  responsable de la formulación"]
[]
[null,null,null,"Si la Ficha Técnica ha sido desarrollada por Administración Directa (Consultoría) Indicar:"]
[]
[null,null,null,"Autor de la Ficha Técnica"]
[null,null,null,"  "]
[null,null,null,"Costo de elaboración de la Ficha Técnica (S/.)"]
[]
[null,null,null,"Si la UF es un Gobierno Regional, Gobierno Local o Sector detallar:"]
[]
[null,null,null,"Nro. de  convenio suscrito con el Gobierno competente"]
[]
[null,null,null,"UNIDAD EJECUTORA DE INVERSIONES (UEI) RECOMENDADA DEL PROYECTO"]
[]
[null,null,null,"Sector "]
[]
[null,null,null,"Pliego "]
[]
[null,null,null,"Nombre de la UEI designada por el Órgano Resolutivo"]
[]
[null,null,null,"Persona responsable de la Unidad Ejecutora de Inversiones"]
[]
[null,null,null,"Si la UEI es un Gobierno Regional o Sector detallar:"]
[]
[null,null,null,"Nro. de  convenio suscrito con el Gobierno competente"]
[]
[]
[]
[]
[]
[]
[null,null,"LOCALIZACIÓN GEOGRÁFICA DE LA UNIDAD PRODUCTORA"]
[]
[null,null,null,"Departamento :"]
[]
[null,null,null,"Provincia :"]
[]
[null,null,null,"Distrito:"]
[]
[null,null,null,"Localidad:"]
[]
[null,null,null,"Microcuenca"]
[]
[null,null,null,"Sub cuenca"]
[]
[null,null,null,"Cuenca"]
[]
[null,null,null," Comunidad Campesina o Indígena"]
[]
[null,null,null,"Código de Ubigeo"]
[]
[null,null,null,"Coordenadas UTM-WGS84",null,null,null,null,null,null,null,null,null,null,"X",null,null,"Y"]
[]
[null,null,null,"Altitud (MSNM)"]

{"sheet":"2.TERRITORIO","index":5,"n_rows":91,"n_cols":32,"rows_kept":91,"cut":false,"hidden":false,"merged":[[14,1,14,16],[49,1,49,27],[56,1,56,27],[48,1,48,27],[19,1,19,27],[28,1,28,27],[36,1,36,27],[43,1,43,27],[42,1,42,27],[20,1,20,27],[29,1,29,27],[37,1,37,27],[58,1,58,27],[64,1,64,27],[66,2,66,6],[66,7,66,11],[66,12,66,15],[66,16,66,21],[60,12,60,15],[60,16,60,21],[61,2,61,6],[62,12,62,15],[62,16,62,21],[78,1,78,17],[78,18,78,22],[79,1,79,17],[79,18,79,22],[80,1,80,17],[80,18,80,22],[84,1,84,27],[92,1,94,7],[81,1,81,17],[81,18,81,22],[82,1,82,17],[82,18,82,22],[87,1,87,27],[86,1,86,27],[88,1,88,27],[90,1,90,27],[92,15,92,27],[76,23,76,27],[76,1,76,17],[76,18,76,22],[68,12,68,15],[68,16,68,21],[70,1,70,27],[73,1,73,17],[72,1,72,17],[72,18,72,22],[72,23,72,27],[73,18,73,22],[74,1,74,17],[75,1,75,17],[74,18,74,22],[75,18,75,22],[74,23,74,27],[75,23,75,27],[60,2,60,6],[60,7,60,11],[61,7,61,11],[61,12,61,15],[61,16,61,21],[62,2,62,6],[62,7,62,11],[67,7,67,11],[67,12,67,15],[73,23,73,27],[67,2,67,6],[67,16,67,21],[68,2,68,6],[68,7,68,11]]}
[]
[]
[]
[]
[]
[]
[]
[]
[]
[]
[]
[]
[]
[]
[null,"SECCIÓN N° 2: DIAGNÓSTICO DEL TERRITORIO"]
[]
[]
[]
[]
[null,2,null,null,null,null,null,null,null,null,null,null,null,null,null,null,null,null,null,null,null,null,null,null,null,null,null,null,null,null,null,"Humedales y lagunas altoandinas"]
[null,2,null,null,null,null,null,null,null,null,null,null,null,null,null,null,null,null,null,null,null,null,null,null,null,null,null,null,null,null,null,"Bofedales"]
[]
[]
[]
[]
[]
[]
[]
[null,1,null,null,null,null,null,null,null,null,null,null,null,null,null,null,null,null,null,null,null,null,null,null,null,null,null,null,null,null,null,"PARAMO"]
[null,1,null,null,null,null,null,null,null,null,null,null,null,null,null,null,null,null,null,null,null,null,null,null,null,null,null,null,null,null,null,"PAJONAL DE PUNA HUMEDA"]
[null,1,null,null,null,null,null,null,null,null,null,null,null,null,null,null,null,null,null,null,null,null,null,null,null,null,null,null,null,null,null,"JALCA"]
[null,null,null,null,null,null,null,null,null,null,null,null,null,null,null,null,null,null,null,null,null,null,null,null,null,null,null,null,null,null,null,"MATORRAL DE PUNA SECA"]
[]
[null,null,null,null,null,null,null,null,null,null,null,null,null,null,null,null,null,null,null,null,null,null,null,null,null,null,null,null,null,null,null,"BOSQUE RELICTO ALTOANDINO (QUENOAL Y OTROS)"]
[null,null,null,null,null,null,null,null,null,null,null,null,null,null,null,null,null,null,null,null,null,null,null,null,null,null,null,null,null,null,null,"BOSQUE RELICTO MONTANO DE VERTIENTE OCCIDENTAL"]
[null,null,null,null,null,null,null,null,null,null,null,null,null,null,null,null,null,null,null,null,null,null,null,null,null,null,null,null,null,null,null,"BOSQUE RELICTO MESOANDINO"]
[null,1,null,null,null,null,null,null,null,null,null,null,null,null,null,null,null,null,null,null,null,null,null,null,null,null,null,null,null,null,null,"BOSQUE ESTACIONALMENTE SECO  INTERANDINO (MARAÑON, MANTARO, PAMPAS Y APURIMAC)"]
[null,1]
[null,null,null,null,null,null,null,null,null,null,null,null,null,null,null,null,null,null,null,null,null,null,null,null,null,null,null,null,null,null,null,"MATORRAL ANDINO"]
[]
[]
[null,null,null,null,null,null,null,null,null,null,null,null,null,null,null,null,null,null,null,null,null,null,null,null,null,null,null,null,null,null,null,"USO POBLACIONAL"]
[null,"2.4.1. Área prioritaria legalmente reconocida",null,null,null,null,null,null,null,null,null,null,null,null,null,null,null,null,null,null,null,null,null,null,null,null,null,null,null,null,null,"USO AGRARIO"]
[null,1]
[]
[]
[]
[]
[null,"2.4.2 Documento de sustento",null,null,null,null,null,null,null,null,null,null,null,null,null,null,null,null,null,null,null,null,null,null,null,null,null,null,null,null,null,"LOS HUMEDALES RECONOCIDOS COMO DE IMPORTANCIA INTERNACIONAL O SITIOS RAMSAR"]
[null,null,null,null,null,null,null,null,null,null,null,null,null,null,null,null,null,null,null,null,null,null,null,null,null,null,null,null,null,null,null,"ÁREAS DE CONSERVACIÓN AMBIENTAL"]
[null,null,null,null,null,null,null,null,null,null,null,null,null,null,null,null,null,null,null,null,null,null,null,null,null,null,null,null,null,null,null,"ZONAS DE PROTECCIÓN Y CONSERVACIÓN ECOLÓGICA Y ZONAS DE RECUPERACIÓN IDENTIFICADAS EN LOS PROCESOS DE ZONIFICACIÓN ECOLÓGICA ECONÓMICA APROBADOS POR EL MINAM"]
[null,null,null,null,null,null,null,null,null,null,null,null,null,null,null,null,null,null,null,null,null,null,null,null,null,null,null,null,null,null,null,"ZONAS PRIORIZADAS POR LOS SISTEMAS REGIONALES DE CONSERVACIÓN"]
[null,null,null,null,null,null,null,null,null,null,null,null,null,null,null,null,null,null,null,null,null,null,null,null,null,null,null,null,null,null,null,"ÁREA NATURAL PROTEGIDA DE ADMINISTRACIÓN NACIONAL O ÁREAS DE CONSERVACIÓN REGIONAL INCLUYENDO SUS ZONAS DE AMORTIGUAMIENTO"]
[null,null,null,null,null,null,null,null,null,null,null,null,null,null,null,null,null,null,null,null,null,null,null,null,null,null,null,null,null,null,null,"ZONAS MARINO COSTERAS, EN EL MARCO DE LA RESOLUCIÓN MINISTERIAL N° 189-2015 MINAM"]
[null,null,null,null,null,null,null,null,null,null,null,null,null,null,null,null,null,null,null,null,null,null,null,null,null,null,null,null,null,null,null,"ZONAS IDENTIFICADAS COMO FAJAS MARGINALES"]
[null,null,null,null,null,null,null,null,null,null,null,null,null,null,null,null,null,null,null,null,null,null,null,null,null,null,null,null,null,null,null,"ECOSISTEMAS DEGRADADOS QUE NO ESTÉN EN LOS ANTERIORES GRUPOS Y QUE DEMUESTREN SU RELEVANCIA ECONÓMICA, SOCIAL, CULTURAL O SI SON ÚNICOS EN EL PAÍS "]
[null,"2.5.1 Identificación del territorio"]
[]
[null,"2.5.1.1. Área de influencia del ecosistema principal"]
[]
[null,"N°","Departamento",null,null,null,null,"Provincia",null,null,null,null,"Distrito",null,null,null,"Localidad/Centro Poblado"]
[]
[]
[]
[null,"2.5.1.2. Área de influencia del ecosistema asociado"]
[]
[null,"N°","Departamento",null,null,null,null,"Provincia",null,null,null,null,"Distrito",null,null,null,"Localidad/Centro Poblado"]
[]
[]
[]
[null,"2.5.1.3. Coordenadas del área de estudio"]
[]
[null,"Descripción",null,null,null,null,null,null,null,null,null,null,null,null,null,null,null,null,"Coordenada X",null,null,null,null,"Coordenada Y"]
[null,"COORDENADAS DEL PUNTO DE CAPTACIÓN (UTM, WGS84)"]
[null,"COORDENADAS DE  LA CUENCA DE APORTE (UTM, WGS84)"]
[null,"COORDENADAS DE LOS ECOSISTEMAS DE INTERÉS HÍDRICO: PRINCIPAL (UTM, WGS84)"]
[null,"COORDENADAS DE LOS ECOSISTEMAS DE INTERÉS HÍDRICO:ASOCIADO (UTM, WGS84)"]
[]
[null,"Descripción",null,null,null,null,null,null,null,null,null,null,null,null,null,null,null,null,"m2"]
[null,"PUNTO DE CAPTACIÓN"]
[null,"CUENCA DE APORTE"]
[null,"ECOSISTEMAS DE INTERÉS HÍDRICO: PRINCIPAL "]
[null,"ECOSISTEMAS DE INTERÉS HÍDRICO:ASOCIADO "]
[]
[null,"2.5.1.4. Mapa de la cuenca bajo estudio"]
[]
[null,"ADJUNTAR EN LOS ANEXOS EL MAPA DE LA CUENCA BAJO ESTUDIO"]
[]
[null,"2.5.1.5. Mapa del área de estudio"]
[]
[null,"ADJUNTAR EN LOS ANEXOS EL MAPA DEL ÁREA DE ESTUDIO "]

{"sheet":"3.POBLACIÓN AFECTADA","index":6,"n_rows":47,"n_cols":18,"rows_kept":47,"cut":false,"hidden":false,"merged":[[22,8,22,10],[15,1,15,14],[17,9,17,15],[18,1,18,10],[21,1,21,10],[21,11,21,20],[19,1,19,8],[27,1,27,7],[27,8,27,10],[27,11,27,20],[23,1,23,10],[24,8,24,10],[25,1,25,7],[25,8,25,10],[25,11,25,20],[26,8,26,10],[24,1,24,7],[26,1,26,7],[44,1,44,10],[40,8,40,10],[28,8,28,10],[30,8,30,10],[31,8,31,10],[35,8,35,10],[29,1,29,10],[31,1,31,7],[35,1,35,7],[40,1,40,7],[32,1,32,10],[34,1,34,10],[36,1,36,10],[38,1,38,10],[42,1,42,10],[45,13,45,15],[46,13,46,15],[47,1,47,3],[47,4,47,6],[47,7,47,9],[47,10,47,12],[47,13,47,15],[46,1,46,9],[45,1,45,3],[45,4,45,6],[45,7,45,9],[45,10,45,12],[48,1,48,3],[48,4,48,6],[48,7,48,9],[48,10,48,12],[48,13,48,15]]}
[]
[]
[]
[]
[]
[]
[]
[]
[]
[]
[]
[]
[]
[]
[]
[null,"SECCIÓN N° 3: DIAGNÓSTICO DE LA POBLACIÓN AFECTADA"]
[]
[]
[null,"3.1.1 ¿La población accede al servicio*?",null,null,null,null,null,null,null,null,null,null,"SI",null,null,"NO"]
[null,"* Por servicio se refiere al servicio ecosistémico de regulación hídrica, cuyo indicador es el caudal en época   de estiaje",null,null,null,null,null,null,null,null,null,null,"(Pase a la pregunta 3.1.3)",null,null,null,"(Pase a la pregunta 3.1.2)"]
[]
[null,"3.1.2 ¿Qué suministro u oferta alternativa suple esta carencia?"]
[]
[null,"3.1.3 ¿Está satisfecho con el servicio que recibe?*",null,null,null,null,null,null,null,null,null,null,"SI",null,null,"NO",null,"(Pase a la pregunta 3.1.4)"]
[]
[null,"3.1.4 ¿Cuáles son las razones que explican dicha situación?"]
[null,"Por ejemplo: La población ha estado recibiendo menos recurso hídrico en epoca seca en su punto de captación debido a la degradación de los ecosistemas que son fuentes de agua"]
[null,"3.1.5 ¿Se encuentra expuesta a condiciones de riesgo?"]
[]
[null,"3.1.6 Características socioeconómicas, demográficas, sociales, culturales, entre otros, que son relevantes para el análisis"]
[]
[null,"3.1.6.1. Características socioeconómicas"]
[null,"3.1.6.1.1. Actividades económicas en las que se ocupa la población afectada"]
[]
[null,"3.1.6.1.2. Niveles de ingreso"]
[null,"3.1.6.2. Características demográficas"]
[null,"3.1.6.2.1. Cantidad de hombres y mujeres"]
[]
[null,"3.1.6.2.2. Tendencia de crecimiento a futuro"]
[]
[null,"3.1.6.3. Características sociales y culturales"]
[]
[null,"3.1.6.3.1. Costumbres relacionadas con el uso del servicio"]
[]
[null,"3.1.6.3.2. Organizaciones culturales"]
[]
[null,"3.1.6.3.3. Idioma"]

{"sheet":"4.UNIDAD PRODUCTORA","index":7,"n_rows":129,"n_cols":35,"rows_kept":129,"cut":false,"hidden":false,"merged":[[30,7,31,9],[32,7,32,9],[33,7,33,9],[44,1,44,5],[26,1,26,6],[27,1,31,6],[32,1,33,6],[20,1,20,14],[39,19,39,20],[36,17,36,18],[32,17,32,18],[32,19,32,20],[33,17,33,18],[34,17,34,18],[35,17,35,18],[26,17,26,18],[26,19,26,20],[44,14,44,16],[34,1,38,6],[27,30,27,31],[27,17,27,18],[27,19,27,20],[28,17,28,18],[28,19,28,20],[29,17,29,18],[29,19,29,20],[30,17,30,18],[31,17,31,18],[30,19,30,20],[31,19,31,20],[45,17,45,19],[46,17,46,19],[44,17,44,19],[47,17,47,19],[37,17,37,18],[38,17,38,18],[36,19,36,20],[37,19,37,20],[38,19,38,20],[45,14,45,16],[46,14,46,16],[47,14,47,16],[34,7,34,9],[37,7,37,9],[45,1,45,5],[46,1,46,5],[46,8,46,10],[47,8,47,10],[46,6,46,7],[47,6,47,7],[46,11,46,13],[47,11,47,13],[44,11,44,13],[45,6,45,7],[45,8,45,10],[45,11,45,13],[47,1,47,5],[44,8,44,10],[57,14,57,16],[33,19,33,20],[34,19,34,20],[35,19,35,20],[69,1,69,5],[24,1,24,16],[42,1,42,16],[38,7,38,9],[26,10,26,16],[27,10,27,16],[28,10,28,16],[29,10,29,16],[30,10,31,16],[32,10,32,16],[33,10,33,16],[34,10,34,16],[35,10,35,16],[36,10,36,16],[37,10,37,16],[38,10,38,16],[35,7,35,9],[36,7,36,9],[29,7,29,9],[27,7,27,9],[77,1,77,5],[28,7,28,9],[26,7,26,9],[44,6,44,7],[58,1,59,5],[50,4,50,5],[64,1,66,5],[52,4,52,5],[54,1,54,16],[65,6,65,16],[62,1,62,16],[59,14,59,16],[59,6,59,13],[56,14,56,16],[55,1,55,8],[55,9,55,15],[56,1,56,5],[51,1,51,3],[52,1,52,3],[51,4,51,5],[58,14,58,16],[56,6,56,13],[57,6,57,13],[58,6,58,13],[57,1,57,5],[60,1,60,16],[49,1,49,5],[50,1,50,3],[77,7,77,11],[65,17,65,25],[64,6,64,25],[96,1,96,11],[92,1,95,2],[92,3,92,8],[93,3,93,8],[94,3,94,8],[95,3,95,8],[74,1,74,5],[68,1,68,5],[90,9,90,12],[90,1,91,2],[90,3,91,8],[67,1,67,5],[70,1,70,5],[71,1,71,5],[72,1,72,5],[73,1,73,5],[88,1,88,16]]}
[]
[]
[]
[]
[]
[]
[]
[]
[]
[]
[]
[]
[]
[]
[]
[]
[]
[]
[]
[]
[null,"SECCIÓN N° 4: DIAGNÓSTICO DE LA UNIDAD PRODUCTORA"]
[]
[]
[]
[null,"4.1.1. Descripción de la situación actual de los factores de producción del servicio ecosistémico de regulación hídrica"]
[]
[null,"FACTOR DE PRODUCCIÓN DEL SERVICIO ECOSISTÉMICO DE REGULACIÓN HÍDRICA",null,null,null,null,null,"VARIABLES TÉCNICAS",null,null,"INFORMES TÉCNICOS, REPORTES QUE SUSTENTEN EL ESTADO DEL ECOSISTEMA DE INTERÉS HÍDRICO",null,null,null,null,null,null,"IMPACTOS IDENTIFICADOS EN LAS VARIABLES TÉCNICAS",null,"DOCUMENTOS DE SUSTENTO"]
[null,"INFRAESTRUCTURA NATURAL - ECOSISTEMA",null,null,null,null,null,"AGUA",null,null,"INFORME TÉCNICO SOBRE LA CANTIDAD (CAUDAL EN EPOCA DE ESTIAJE) Y CALIDAD DEL AGUA, ELABORADO POR EXPERTO TEMÁTICO",null,null,null,null,null,null,false,null,{"$f":"IF(R28=TRUE,\"RESULTADO DE ANÁLISIS DE LABORATORIO E INFORME TÉCNICO ELABORADO POR ESPECIALISTA TEMÁTICO\",\"\")","v":""}]
[null,null,null,null,null,null,null,"SUELOS",null,null,"INFORME TÉCNICO SOBRE CARACTERÍSTICAS RELACIONADAS A LA INFILTRACIÓN DE SUELOS, ELABORADO POR EXPERTO TEMÁTICO",null,null,null,null,null,null,false,null,{"$f":"IF(R29=TRUE,\"INFORME TÉCNICO DE SUELO, ELABORADO POR ESPECIALISTA TEMÁTICO\",\"\")","v":""}]
[null,null,null,null,null,null,null,"CARACTERÍSTICAS DEL CLIMA ACTUAL Y TENDENCIAS. IDENTIFICACIÓN DE PELIGROS ASOCIADOS AL CAMBIO CLIMÁTICO",null,null,"ESTUDIO DEL CLIMA ACTUAL Y TENDENCIAS. IDENTIFICACIÓN DE PELIGROS ASOCIADOS AL CAMBIO CLIMÁTICO",null,null,null,null,null,null,false,null,{"$f":"IF(R30=TRUE,\"INFORME DE CLIMA ACTUAL Y FUTURO. INFORME DE PELIGROS EN UN CONTEXTO DE CAMBIO CLIMÁTICO\",\"\")","v":""}]
[null,null,null,null,null,null,null,"COBERTURA",null,null,"INFORME TÉCNICO DEL PARÁMETRO COBERTURA VEGETAL E INTRODUCCIÓN DE ESPECIES EXÓTICAS.",null,null,null,null,null,null,false,null,{"$f":"IF(R31=TRUE,\"LISTADO DE ESPECIES DEL ECOSISTEMA\",\"\")","v":""}]
[null,null,null,null,null,null,null,null,null,null,null,null,null,null,null,null,null,false,null,{"$f":"IF(R32=TRUE,\"LISTADO DE ESPECIES EXÓTICAS ENCONTRADAS\",\"\")","v":""}]
[null,"INTANGIBLE-CAPACIDAD HUMANA: MANEJO DE LOS ECOSISTEMAS DE INTERÉS HÍDRICO",null,null,null,null,null,"PRÁCTICAS DE CONSERVACIÓN DEL AGUA",null,null,"FICHAS DE DIAGNÓSTICO DE PRÁCTICAS DE CONSERVACION DEL AGUA",null,null,null,null,null,null,false,null,{"$f":"IF(R33=TRUE,\"FICHA DE DIAGNÓSTICO DE PRÁCTICAS DE CONSERVACIÓN DE AGUA\",\"\")","v":""}]
[null,null,null,null,null,null,null,"PRÁCTICAS DE CONSERVACIÓN Y MANEJO DE ECOSISTEMAS DE INTERÉS HÍDRICO",null,null,"FICHAS DE DIAGNÓSTICO DE PRÁCTICAS DE CONSERVACIÓN Y MANEJO DE ECOSISTEMAS DE INTERÉS HÍDRICO",null,null,null,null,null,null,false,null,{"$f":"IF(R34=TRUE,\"FICHA DE DIAGNÓSTICO DE PRÁCTICAS DE CONSERVACIÓN Y MANEJO DE ECOSISTEMAS DE INTERES HÍDRICO\",\"\")","v":""}]
[null,"INTANGIBLE-CAPACIDAD ORGANIZACIONAL: GESTIÓN INTEGRADA DEL SERVICIO ECOSISTÉMICO ANDINO RURAL",null,null,null,null,null,"CAPACIDADES PARA LA GESTIÓN DEL ECOSISTEMA DE INTERÉS HÍDRICO",null,null,"INFORME DEL ÁREA DE RECURSOS HUMANOS DE LA INSTITUCIÓN ENCARGADA DE LA GESTIÓN DEL ECOSISTEMA DE INTERÉS HÍDRICO",null,null,null,null,null,null,false,null,{"$f":"IF(R35=TRUE,\"RELACIÓN DE TRABAJADORES CAPACITADOS\",\"\")","v":""}]
[null,null,null,null,null,null,null,"SENSIBILIZACIÓN AMBIENTAL",null,null,"INFORME DE RESULTADO DE ENCUESTAS",null,null,null,null,null,null,false,null,{"$f":"IF(R36=TRUE,\"ENCUESTA\",\"\")","v":""}]
[null,null,null,null,null,null,null,"INFORMACIÓN AMBIENTAL",null,null,"INFORME DEL ÁREA TÉCNICA DANDO CUENTA DE LOS ESTUDIOS DISPONIBLES Y APLICADOS",null,null,null,null,null,null,false,null,{"$f":"IF(R37=TRUE,\"LISTADO DE ESTUDIOS\",\"\")","v":""}]
[null,null,null,null,null,null,null,"SEGUIMIENTO Y MONITOREO AMBIENTAL",null,null,"REPORTE DE ACCIONES DE SEGUIMIENTO Y MONITOREO",null,null,null,null,null,null,false,null,{"$f":"IF(R38=TRUE,\"REPORTE DE ACCIONES DE SEGUIMIENTO Y MONITOREO\",\"\")","v":""}]
[null,null,null,null,null,null,null,"ORGANIZACIÓN COMUNAL AMBIENTAL",null,null,"REPORTE DE INSTRUMENTOS DE GESTIÓN EXISTENTES",null,null,null,null,null,null,false,null,{"$f":"IF(R39=TRUE,\"LISTADO DE INSTRUMENTOS DE GESTIÓN EXISTENTES\",\"\")","v":""}]
[]
[]
[]
[null,"4.1.2. Accesibilidad al bien"]
[]
[null,"TRAMOS",null,null,null,null,"TIPO DE VÍA",null,"DISTANCIA (EN KM)",null,null,"TIEMPO DE RECORRIDO (EN MINUTOS)",null,null,"ESTADO DE CONSERVACIÓN DEL TRAMO",null,null,"TIPO DE TRASLADO",null,null,null,null,null,null,null,null,null,null,null,null,null,null,"AFIRMADO","BUENO ","A PIE"]
[null,null,null,null,null,null,null,null,null,null,null,null,null,null,null,null,null,null,null,null,null,null,null,null,null,null,null,null,null,null,null,null,"ASFALTADO","REGULAR","ASEMILA"]
[null,null,null,null,null,null,null,null,null,null,null,null,null,null,null,null,null,null,null,null,null,null,null,null,null,null,null,null,null,null,null,null,"CAMINOS DE HERRADURA","MALO","AUTO"]
[null,null,null,null,null,null,null,null,null,null,null,null,null,null,null,null,null,null,null,null,null,null,null,null,null,null,null,null,null,null,null,null,"CARRETERA",null,"BUS INTERPROVINCIAL"]
[null,null,null,null,null,null,null,null,null,null,null,null,null,null,null,null,null,null,null,null,null,null,null,null,null,null,null,null,null,null,null,null,"SIN VIA",null,"CAMION"]
[null,"CONDICIÓN FINAL DE LA ACCESIBILIDAD AL ECOSISTEMA:",null,null,null,null,null,null,null,null,null,null,null,null,null,null,null,null,null,null,null,null,null,null,null,null,null,null,null,null,null,null,"TROCHA CARROZABLE",null,"CAMIONETA"]
[null,"BUENA",null,null,null,null,null,null,null,null,null,null,null,null,null,null,null,null,null,null,null,null,null,null,null,null,null,null,null,null,null,null,null,null,"VEHICULO MENOR"]
[null,"REGULAR"]
[null,"MALA"]
[]
[null,"4.1.3. Indicadores de la situación actual"]
[]
[null,"Ejes de análisis",null,null,null,null,"Indicadores",null,null,null,null,null,null,null,"Valor Actual"]
[null,"SERVICIO ECOSISTÉMICO DE REGULACIÓN HÍDRICA",null,null,null,null,"SUPERFICIE DE ECOSISTEMAS DEGRADADOS QUE BRINDAN SERVICIOS ECOSISTÉMICOS DE REGULACIÓN HÍDRICA QUE REQUIEREN DE RECUPERACIÓN(*)"]
[null,"GESTIÓN DEL SISTEMA ANDINO RURAL",null,null,null,null,"LIMITADA GESTIÓN EN LOS ECOSISTEMAS DE INTERÉS HÍDRICO",null,null,null,null,null,null,null,1,null,null,null,null,null,null,null,null,null,null,null,null,null,null,null,null,null,"SI"]
[null,null,null,null,null,null,"INADECUADAS PRÁCTICAS DE MANEJO DE LOS ECOSISTEMAS DE INTERÉS HÍDRICO",null,null,null,null,null,null,null,1,null,null,null,null,null,null,null,null,null,null,null,null,null,null,null,null,null,"NO"]
[null,"(*) Este indicador se utiliza por ser la variable que cierra la brecha del PMI. Cabe señalar que el indicador para la estimación de la disminución del servicio ecosistémico de regulación hídrica es el caudal en época de estiaje en el punto de captación (m3/año), para ello se utiliza el metodo RAS en situación Sin Proyecto (S/P) - pestaña \"Comunicación Técnica\", o recopilacion de información de aforadores o data histórica de volumen de agua capturado de los usuarios (poblacionall, agrícola) u otro metodologia. Cabe señalar que se puede utilizar el método elegido para elaborar el Expediente técnico."]
[]
[null,"4.1.4. Estimar la exposición de la UP frente a los peligros identificados en el diagnóstico del área de estudio"]
[]
[null,"Peligros",null,null,null,null,"Exposición de ecosistemas"]
[null,null,null,null,null,null,"Ecosistema en zonas  planas o con pendientes moderadas.",null,null,null,null,null,null,null,null,null,null,"Ecosistema en zonas de ladera"]
[null,null,null,null,null,null,"Páramo","Pajonal de Puna Húmeda","Jalca","Matorral de puna seca","Bosque relicto altoandino","Bosque relicto montano de vertiente occidental ","Bosque relicto mesoandino","Bosque estacionalmente seco interandino","Matorral andino","Bofedal","Lagunas","Páramo","Pajonal de Puna Húmeda","Jalca","Matorral de puna seca","Bosque relicto altoandino","Bosque relicto montano de vertiente occidental ","Bosque relicto mesoandino","Bosque estacionalmente seco interandino","Matorral andino"]
[null,"Variaciones de la temperatura"]
[null,"Variaciones del ciclo de lluvias"]
[null,"Mayor intensidad de las lluvias"]
[null,"Contaminación natural del agua"]
[null,"Incremento de la erosión de suelos"]
[null,"Mayor ocurrencia y/o intensidad de heladas"]
[null,"Mayor ocurrencia y/o intensidad de sequias"]
[null,"…"]
[null,"A continuación se muestra el porcentaje de las pendientes, según su tamaño:"]
[]
[null,"Pendiente corta",null,null,null,null,null,"Pendiente larga"]
[]
[null,"·         Plano a ligeramente inclinado: 0 – 4%",null,null,null,null,null,"·         Plano a casi nivel: 0 – 2%"]
[null,"·         Moderadamente inclinada: 4% - 8%",null,null,null,null,null,"·         Ligeramente inclinado: 2% - 4%"]
[null,"·         Fuertemente inclinada: 8% - 15%",null,null,null,null,null,"·         Moderadamente inclinado: 4% - 8%"]
[null,"·         Moderadamente empinada : 15% - 25%",null,null,null,null,null,"·         Fuertemente inclinado: 8% - 15%"]
[null,"·         Empinada: 25% - 50%",null,null,null,null,null,"·         Moderadamente empinado: 15% - 25%"]
[null,"·         Muy empinada: 50% - 75%",null,null,null,null,null,"·         Empinado: 25% - 50%"]
[null,"·         Extremadamente empinada: > 75%",null,null,null,null,null,"·         Muy empinado: 50% - 75%"]
[null,null,null,null,null,null,null,"·         Extremadamente empinado: >75%"]
[]
[null,"4.1.5. Describir la resiliencia "]
[]
[null,"Factor de Resiliencia*",null,"Variable",null,null,null,null,null,"Grado de resiliencia"]
[null,null,null,null,null,null,null,null,null,"Bajo","Medio","Alto","Muy alto"]
[null,"Resiliencia",null,"Capacidades técnicas y operativas"]
[null,null,null,"Capacidad de gestión"]
[null,null,null,"Capacidades financieras "]
[null,null,null,"Capacidades de los usuarios (ingresos, conocimiento de prácticas adecuadas ante daños y riesgos potenciales frente a una eventual interrupción de la provisión del servicio o una gradual disminución de la oferta, capacidades organizativas)"]
[null,"*El llenado del cuadro es para cada UP o para cada uno de sus activos (en caso presenten distinta localización) \n"]
[]
[]
[]
[]
[]
[]
[]
[]
[]
[]
[]
[]
[]
[]
[]
[]
[]
[]
[]
[]
[]
[]
[]
[]
[]
[]
[]
[]
[]
[]
[]
[null,null,null,null,null,null,null,null,null,null,null,null,null,null,null,null,null,null,null,null,null,null,null,null,null,null,null,null,null,null,null,false]

{"sheet":"5.OTROS AGENTES INVOLUCRADOS","index":8,"n_rows":27,"n_cols":26,"rows_kept":27,"cut":false,"hidden":false,"merged":[[15,1,15,14],[16,9,16,15],[17,1,17,5],[17,7,17,9],[17,10,17,15],[17,16,17,18],[17,19,17,21],[17,22,17,24],[17,25,17,27],[18,1,18,5],[18,7,18,9],[18,10,18,15],[18,16,18,18],[18,19,18,21],[18,22,18,24],[18,25,18,27],[19,25,19,27],[20,1,20,5],[20,7,20,9],[20,10,20,15],[20,16,20,18],[20,19,20,21],[20,22,20,24],[20,25,20,27],[19,1,19,5],[19,7,19,9],[19,10,19,15],[19,16,19,18],[19,19,19,21],[19,22,19,24],[21,25,21,27],[22,1,22,5],[22,7,22,9],[22,10,22,15],[22,16,22,18],[22,19,22,21],[22,22,22,24],[22,25,22,27],[21,1,21,5],[21,7,21,9],[21,10,21,15],[21,16,21,18],[21,19,21,21],[21,22,21,24],[23,25,23,27],[24,1,24,5],[24,7,24,9],[24,10,24,15],[24,16,24,18],[24,19,24,21],[24,22,24,24],[24,25,24,27],[23,1,23,5],[23,7,23,9],[23,10,23,15],[23,16,23,18],[23,19,23,21],[23,22,23,24],[25,25,25,27],[26,1,26,5],[26,7,26,9],[26,10,26,15],[26,16,26,18],[26,19,26,21],[26,22,26,24],[26,25,26,27],[25,1,25,5],[25,7,25,9],[25,10,25,15],[25,16,25,18],[25,19,25,21],[25,22,25,24],[27,1,27,3],[29,1,32,3],[29,4,29,5],[29,6,29,7],[29,8,29,10],[30,4,30,5],[30,6,30,7],[30,8,30,10],[31,4,31,5],[31,6,31,7],[31,8,31,10],[32,4,32,5],[32,6,32,7],[32,8,32,10],[33,1,34,3],[33,4,33,5],[33,6,33,7],[33,8,33,10],[34,4,34,5],[34,6,34,7],[37,8,37,10],[38,1,38,3],[38,6,38,7],[38,8,38,10],[39,1,39,3],[39,6,39,7],[39,8,39,10],[34,8,34,10],[35,1,35,3],[35,4,44,5],[35,6,35,7],[35,8,35,10],[36,1,36,3],[36,6,36,7],[36,8,36,10],[37,1,37,3],[37,6,37,7],[42,1,42,3],[42,6,42,7],[42,8,42,10],[43,1,43,3],[43,6,43,7],[43,8,43,10],[40,1,40,3],[40,6,40,7],[40,8,40,10],[41,1,41,3],[41,6,41,7],[41,8,41,10],[44,1,44,3],[44,6,44,7],[44,8,44,10],[47,1,47,15],[49,1,49,3],[49,4,49,6],[49,7,49,9],[49,10,49,12],[49,13,49,15],[51,1,51,3],[51,4,51,6],[51,7,51,9],[51,10,51,12],[51,13,51,15],[52,1,52,3],[52,4,52,6],[52,7,52,9],[52,10,52,12],[52,13,52,15],[55,1,55,3],[55,4,55,6],[55,7,55,9],[55,10,55,12],[55,13,55,15],[53,1,53,3],[53,4,53,6],[53,7,53,9],[53,10,53,12],[53,13,53,15],[54,1,54,3],[54,4,54,6],[54,7,54,9],[54,10,54,12],[54,13,54,15]]}
[]
[]
[]
[]
[]
[]
[]
[]
[]
[]
[]
[]
[]
[]
[]
[null,"SECCIÓN N° 5: DIAGNÓSTICO DE OTROS AGENTES INVOLUCRADOS"]
[]
[null,"Agente Involucrado",null,null,null,null,"Número","Ámbito del participante",null,null,"Posición (Cooperante, Oponente)",null,null,null,null,null,"Situación negativa bajo análisis",null,null,"Expectativas o intereses",null,null,"Compromiso/Acuerdos",null,null,"Percepción"]
[null,null,null,null,null,null,null,0,null,null,0]
[null,null,null,null,null,null,null,0,null,null,0]
[null,null,null,null,null,null,null,0,null,null,0]
[null,null,null,null,null,null,null,0,null,null,0]
[null,null,null,null,null,null,null,0,null,null,0]
[null,null,null,null,null,null,null,0,null,null,0]
[null,null,null,null,null,null,null,0,null,null,0]
[null,null,null,null,null,null,null,0,null,null,0]
[null,null,null,null,null,null,null,0,null,null,0]

{"sheet":"6.PROBLEMA-OBJETIVO","index":9,"n_rows":130,"n_cols":9,"rows_kept":130,"cut":false,"hidden":false,"merged":[[21,1,21,14],[117,6,117,9],[112,2,117,5],[112,1,117,1],[118,6,118,9],[119,6,119,9],[123,0,127,0],[124,2,128,5],[124,1,128,1],[123,6,123,9],[118,2,123,5],[118,1,123,1],[124,6,124,9],[125,6,125,9],[126,6,126,9],[127,6,127,9],[128,6,128,9],[120,6,120,9],[121,6,121,9],[122,6,122,9],[114,6,114,9],[115,6,115,9],[116,6,116,9],[110,6,110,9],[111,6,111,9],[110,1,111,1],[112,6,112,9],[113,6,113,9],[110,2,111,5],[105,6,105,9],[106,6,106,9],[107,6,107,9],[108,6,108,9],[106,2,109,5],[106,1,109,1],[104,2,105,5],[109,6,109,9],[72,1,72,5],[72,6,72,9],[73,1,73,5],[73,6,73,9],[63,1,63,9],[68,1,68,12],[70,1,70,4],[51,5,51,8],[52,5,52,8],[58,1,58,12],[60,1,60,12],[66,1,66,12],[101,2,103,5],[101,1,103,1],[102,6,102,9],[103,6,103,9],[74,1,74,5],[74,6,74,9],[75,1,75,5],[75,6,75,9],[95,1,95,4],[95,5,95,7],[95,8,95,10],[94,1,94,4],[94,5,94,7],[94,8,94,10],[100,2,100,5],[100,6,100,9],[25,1,25,12],[27,1,27,12],[29,1,29,4],[29,5,29,7],[29,8,29,10],[30,1,30,4],[30,5,30,7],[30,8,30,10],[41,5,41,8],[39,5,39,8],[40,5,40,8],[40,1,41,4],[37,1,39,4],[129,1,129,9],[76,1,76,9],[34,1,36,4],[33,5,33,8],[34,5,34,8],[33,1,33,4],[36,5,36,8],[38,5,38,8],[37,5,37,8],[35,5,35,8],[42,5,42,8],[44,1,44,4],[48,5,48,8],[44,5,44,8],[45,5,45,8],[46,5,46,8],[47,5,47,8],[45,1,47,4],[48,1,52,4],[49,5,49,8],[50,5,50,8],[101,6,101,9],[104,6,104,9],[104,1,105,1]]}
[]
[]
[]
[]
[]
[]
[]
[]
[]
[]
[]
[]
[]
[]
[]
[]
[]
[]
[]
[]
[]
[null,"SECCIÓN N° 6: PROBLEMA/OBJETIVO"]
[]
[]
[]
[null,"Descripción del problema central"]
[]
[null,{"$f":"CONCATENATE(\"DISMINUCIÓN DEL \",F31,\" EN LA \",I30,\" DE \",I31)","v":"DISMINUCIÓN DEL SERVICIO ECOSISTÉMICO DE REGULACIÓN HÍDRICA EN LA MICROCUENCA DE 0"}]
[]
[null,"NATURALEZA",null,null,null,"OBJETO",null,null,"MICROCUENCA"]
[null,"DEGRADACIÓN",null,null,null,{"$f":"'1.DATOS GENERALES'!N40","v":"SERVICIO ECOSISTÉMICO DE REGULACIÓN HÍDRICA"},null,null,{"$f":"'1.DATOS GENERALES'!T124","v":0}]
[]
[]
[null,"Causas Directas (CD)",null,null,null,"Causas indirectas (CI)"]
[null,"DISMINUCIÓN DE CAPACIDAD DE ALMACENAMIENTO DEL AGUA EN EL ECOSISTEMA PRINCIPAL",null,null,null,"ALTERACIÓN DE LA COBERTURA VEGETAL NATIVA"]
[null,null,null,null,null,"ALTERACIÓN DE LAS CARACTERÍSTICAS DE LA TURBA "]
[null,null,null,null,null,"CAMBIO EN EL RÉGIMEN DE PRECIPITACIONES Y TEMPERATURAS"]
[null,"DISMINUCIÓN DE LA CAPACIDAD DE INFILTRACIÓN DEL AGUA EN EL ECOSISTEMA ASOCIADO",null,null,null,"DISMINUCIÓN DE LA COBERTURA VEGETAL NATIVA"]
[null,null,null,null,null,"ALTERACIÓN DE LAS CARACTERÍSTICAS DEL SUELO"]
[null,null,null,null,null,"CAMBIO EN EL RÉGIMEN DE PRECIPITACIONES Y TEMPERATURAS"]
[null,"INADECUADA GESTIÓN DEL SERVICIO ECOSISTÉMICO DE REGULACIÓN HÍDRICA",null,null,null,"INADECUADO MANEJO DE LOS ECOSISTEMAS DE INTERÉS HÍDRICO"]
[null,null,null,null,null,"INADECUADA CAPACIDAD DE GESTIÓN DE LOS ECOSISTEMAS DE INTERÉS HÍDRICO"]
[]
[]
[null,"Efectos Directos (ED)",null,null,null,"Efectos Indirectos (EI)"]
[null,"MENOR DISPONIBILIDAD DEL SERVICIO ECOSISTÉMICOS DE PROVISIÓN DEL RECURSO HÍDRICO",null,null,null,"DISMINUCIÓN DE LA OFERTA DEL AGUA POTABLE PARA USO POBLACIONAL"]
[null,null,null,null,null,"DISMINUCIÓN DE LA OFERTA DEL AGUA PARA USO AGROPECUARIO"]
[null,null,null,null,null,"DISMINUCIÓN DE LA OFERTA DEL AGUA PARA USO ENERGÉTICO"]
[null,"INCREMENTO EN EL DETERIORO DE LOS ECOSISTEMAS",null,null,null,"DISMINUCIÓN DEL SERVICIO ECOSISTÉMICO DE PROVISIÓN DE LOS RECURSOS GENÉTICOS"]
[null,null,null,null,null,"DISMINUCIÓN DEL SERVICIO ECOSISTÉMICO DE PROVISIÓN DE COMBUSTIBLE"]
[null,null,null,null,null,"DISMINUCIÓN DEL SERVICIO ECOSISTÉMICO DE PROVISIÓN DE FORRAJE"]
[null,null,null,null,null,"DISMINUCIÓN DEL SERVICIO ECOSISTÉMICO DE PROVISIÓN DE MEDICINAS NATURALES"]
[null,null,null,null,null,"DISMINUCIÓN DEL SERVICIO ECOSISTÉMICO DE PROVISIÓN DE PRODUCTOS BIOQUÍMICOS"]
[]
[]
[]
[]
[]
[null,"Efecto Final"]
[]
[null,"DISMINUCIÓN DEL APROVECHAMIENTO SOSTENIBLE DEL CAPITAL NATURAL"]
[]
[]
[]
[]
[]
[null,"Descripción del objetivo central"]
[]
[null,{"$f":"CONCATENATE(B96,\" DEL \",F96,\" DE LA \",I95,\" DE \", I96)","v":"RECUPERACIÓN DEL SERVICIO ECOSISTÉMICO DE REGULACIÓN HÍDRICA DE LA MICROCUENCA DE 0"}]
[]
[null,"Indicadores del Objetivo"]
[]
[null,"PRINCIPALES INDICADORES DE OBJETIVO",null,null,null,null,"UNIDAD DE MEDIDA"]
[null,"ECOSISTEMA ANDINO DE INTERÉS HÍDRICO PRINCIPAL RECUPERADO*",null,null,null,null,"HECTÁREAS RECUPERADAS"]
[null,"IMPLEMENTACIÓN DE ADECUADA GESTION EN EL ECOSISTEMA DEGRADADO",null,null,null,null,"ÁREA ORGÁNICA IMPLEMENTADA"]
[null,"ADECUADAS PRÁCTICAS DE MANEJO DEL ECOSISTEMA",null,null,null,null,"N° DE POBLADORES CAPACITADOS"]
[null,"(*) Este indicador se utiliza por ser la variable para cerrar la brecha del PMI. El objetivo del proyecto es la recuperación de la regulación hídrica, es decir, medir el incremento del caudal en época de estiaje en el punto de toma (m3/año). Para ello se utiliza el método RAS en la situación Con Proyecto (C/P) u otro metodologia. Dicho indicador se tiene que reflejar en el marco lógico.\nEl indicador de caudal en época de estiaje es importante para el seguimiento y monitoreo en la fase de funcionamiento de los proyectos. La estimación de este indicador permitirá mejorar los modelos utilizados con información resultado del seguimiento y monitoreo de la fase de la ejecución del proyecto, logrando de esta manera determinar métodos de regulacion hidrica más eficientes."]
[]
[]
[]
[]
[]
[]
[]
[]
[]
[]
[]
[]
[]
[]
[]
[]
[]
[null,"NATURALEZA",null,null,null,"OBJETO",null,null,"MICROCUENCA"]
[null,"RECUPERACIÓN",null,null,null,{"$f":"'1.DATOS GENERALES'!N40","v":"SERVICIO ECOSISTÉMICO DE REGULACIÓN HÍDRICA"},null,null,{"$f":"'1.DATOS GENERALES'!T124","v":0}]
[]
[]
[]
[]
[null,"N°","Medios fundamentales (MF)",null,null,null,"Acciones (*)"]
[null,1,"RECUPERACIÓN DE LA COBERTURA VEGETAL NATIVA DEL ECOSISTEMA PRINCIPAL",null,null,null,"REVEGETACIÓN CON ESPECIES NATIVAS"]
[null,null,null,null,null,null,"INSTALACIÓN DE CERCOS EXCLUIDORES"]
[null,null,null,null,null,null,"OTRO:"]
[null,2,"RECUPERACIÓN DE LAS CARACTERÍSTICAS DE LA TURBA DEL ECOSISTEMA PRINCIPAL",null,null,null,"REVEGETACIÓN CON ESPECIES NATIVAS"]
[null,null,null,null,null,null,"OTRO:"]
[null,3,"RECUPERACIÓN DE LA COBERTURA VEGETAL DE LOS ECOSISTEMAS ASOCIADOS",null,null,null,"REFORESTACIÓN CON ESPECIES NATIVAS"]
[null,null,null,null,null,null,"REVEGETACIÓN CON ESPECIES NATIVAS"]
[null,null,null,null,null,null,"INSTALACIÓN DE CERCOS EXCLUIDORES"]
[null,null,null,null,null,null,"OTRO:"]
[null,4,"RECUPERACIÓN DE LAS CARACTERÍSTICAS DEL SUELO DEL ECOSISTEMA ASOCIADO",null,null,null,"ENRIQUECIMIENTO DE SUELOS"]
[null,null,null,null,null,null,"OTRO:"]
[null,5,"ADAPTACIÓN A LOS REGÍMENES DE PRECIPITACIÓN Y TEMPERATURAS",null,null,null,"REPARACIÓN DEL CANAL AMUNADOR"]
[null,null,null,null,null,null,"REPARACIÓN DEL CANAL DE MAMANTEO"]
[null,null,null,null,null,null,"CONSTRUCCIÓN DE ZANJAS DE INFILTRACIÓN"]
[null,null,null,null,null,null,"INSTALACIÓN DE QOCHAS"]
[null,null,null,null,null,null,"CONSTRUCCIÓN DE TERRAZAS DE FORMACIÓN DE SUELOS"]
[null,null,null,null,null,null,"OTRO:"]
[null,6,"ADECUADAS PRÁCTICAS DEL MANEJO DEL ECOSISTEMA",null,null,null,"CAPACITACIÓN EN GESTIÓN INTEGRADA DE RECURSOS HÍDRICOS CON ENFOQUE DE CUENCA"]
[null,null,null,null,null,null,"ASISTENCIA TÉCNICA EN EL MANEJO DE ECOSISTEMAS DE INTERÉS HIDRICO"]
[null,null,null,null,null,null,"CAPACITACIÓN EN BUENAS PRÁCTICAS PARA LA ADAPTACIÓN AL CAMBIO CLIMÁTICO Y GESTIÓN DE RIESGOS"]
[null,null,null,null,null,null,"SENSIBILIZACIÓN RELACIONADA A LA RECUPERACIÓN DEL SERVICIO ECOSISTÉMICO DE REGULACIÓN HÍDRICA"]
[null,null,null,null,null,null,"INTERCAMBIO DE EXPERIENCIAS RELACIONADAS A LA RECUPERACIÓN DEL SERVICIO ECOSISTÉMICO DE REGULACIÓN HÍDRICA"]
[null,null,null,null,null,null,"OTRO:"]
[null,7,"ADECUADAS CAPACIDADES DE LAS ENTIDADES A CARGO DE LA GESTIÓN DEL ECOSISTEMA",null,null,null,"CAPACITACIÓN A FUNCIONARIOS PÚBLICOS SOBRE LA GESTIÓN INTEGRADA DEL RECURSO HÍDRICO CON ENFOQUE DE CUENCA"]
[null,null,null,null,null,null,"CAPACITACIÓN A FUNCIONARIOS PÚBLICOS SOBRE LAS MEDIDAS DE ADAPTACIÓN EN UN CONTEXTO DE CAMBIO CLIMÁTICO EN LA GESTIÓN INTEGRADA DE LOS RECURSOS HÍDRICOS"]
[null,null,null,null,null,null,"DESARROLLO DE CAPACIDADES PARA EL MONITOREO Y SEGUIMIENTO DE LOS ECOSISTEMAS DE INTERÉS HÍDRICO Y EL SERVICIO ECOSISTÉMICO DE REGULACIÓN HÍDRICA"]
[null,null,null,null,null,null,"INTERCAMBIO DE EXPERIENCIA SOBRE LA GESTIÓN INTEGRADA DEL RECURSO HÍDRICO CON ENFOQUE DE CUENCA"]
[null,null,null,null,null,null,"OTRO:"]
[null,"(*) La naturaleza de las acciones asociadas a los medios fundamentales del N° 1 al N° 5 corresponden a \"Adecuación\" debido a que el factor de producción es \"Infraestructura Natural\", mientras que las acciones asociadas a los medios fundamentales N° 6 y N° 7 tienen como naturaleza \"Implementación\" debido a que el factor de producción es \"Intangible\". Estas consideraciones han sido desarrolladas en base a la Tabla 2.22 de la \"Guía General para la Identificación, Formulación y Evaluación de Proyectos de Inversión\" del Invierte.pe."]

{"sheet":"7.HORIZONTE DE EVALUACIÓN","index":10,"n_rows":41,"n_cols":9,"rows_kept":41,"cut":false,"hidden":false,"merged":[[37,9,37,11],[38,1,39,12],[18,1,18,14],[34,1,34,14]]}
[]
[]
[]
[]
[]
[]
[]
[]
[]
[]
[]
[]
[]
[]
[]
[]
[]
[]
[null,"SECCIÓN N° 7: HORIZONTE DE EVALUACIÓN"]
[]
[]
[]
[]
[]
[]
[]
[]
[]
[]
[]
[]
[]
[]
[]
[null,"7.1. Horizonte de evaluación"]
[]
[]
[null,"Periodo en meses de la ejecución del proyecto",null,null,null,null,null,null,"meses"]
[]
[]
[null,"Periodo en años del funcionamiento del proyecto",null,null,null,null,null,null,"años"]

{"sheet":"8.ANALISIS TÉCNICO","index":11,"n_rows":185,"n_cols":23,"rows_kept":185,"cut":false,"hidden":false,"merged":[[83,12,83,13],[79,10,79,11],[80,10,80,11],[77,12,77,13],[78,12,78,13],[79,12,79,13],[80,12,80,13],[81,12,81,13],[76,10,76,11],[77,10,77,11],[131,6,131,10],[181,1,181,2],[166,5,166,6],[167,5,167,6],[168,5,168,6],[169,5,169,6],[25,1,27,1],[28,1,29,1],[30,1,33,1],[34,1,35,1],[36,1,41,1],[42,1,47,1],[48,1,52,1],[72,1,74,1],[75,1,76,1],[69,1,71,1],[89,3,89,6],[87,3,87,6],[92,7,92,9],[93,10,93,11],[73,10,73,11],[74,10,74,11],[81,10,81,11],[78,10,78,11],[120,6,120,10],[124,6,124,10],[118,6,118,10],[121,6,121,10],[122,6,122,10],[115,11,115,12],[184,1,184,8],[183,1,183,8],[77,1,80,1],[81,1,82,1],[83,1,88,1],[89,1,94,1],[95,1,99,1],[89,7,89,9],[127,6,127,10],[181,5,181,6],[169,3,169,4],[170,3,170,4],[177,1,177,2],[162,1,162,2],[95,2,99,2],[96,7,96,9],[130,6,130,10],[129,6,129,10],[107,6,107,10],[104,11,104,12],[99,3,99,6],[98,7,98,9],[95,7,95,9],[98,10,98,11],[99,10,99,11],[103,3,104,5],[103,11,103,15],[87,7,87,9],[89,10,89,11],[90,10,90,11],[94,3,94,6],[97,12,97,13],[15,1,15,14],[95,10,95,11],[96,10,96,11],[96,3,96,6],[97,3,97,6],[97,7,97,9],[97,10,97,11],[68,13,68,18],[93,7,93,9],[77,2,80,2],[89,2,94,2],[84,12,84,13],[85,12,85,13],[86,12,86,13],[88,12,88,13],[69,12,71,13],[72,12,72,13],[73,12,73,13],[74,12,74,13],[98,12,98,13],[99,12,99,13],[107,11,107,12],[94,10,94,11],[106,13,106,15],[104,13,104,15],[139,20,139,21],[138,20,138,21],[132,20,132,21],[126,20,126,21],[112,18,116,19],[112,16,116,17],[112,20,112,21],[114,20,114,21],[114,6,114,10],[114,11,114,12],[114,13,114,15],[112,6,112,10],[116,13,116,15],[115,6,115,10],[113,6,113,10],[113,11,113,12],[122,13,122,15],[115,13,115,15],[138,22,138,24],[134,20,134,21],[134,16,139,17],[134,18,139,19],[132,22,132,24],[139,11,139,12],[139,13,139,15],[134,11,134,15],[139,22,139,24],[136,20,136,21],[136,22,136,24],[137,13,137,15],[137,20,137,21],[137,22,137,24],[133,20,133,21],[133,22,133,24],[135,20,135,21],[135,13,135,15],[135,22,135,24],[136,11,136,12],[136,13,136,15],[134,22,134,24],[127,16,133,17],[127,18,133,19],[129,11,129,12],[128,22,128,24],[131,20,131,21],[131,22,131,24],[127,20,127,21],[129,20,129,21],[129,22,129,24],[130,11,130,12],[130,13,130,15],[130,20,130,21],[130,22,130,24],[131,13,131,15],[133,11,133,12],[133,13,133,15],[128,20,128,21],[129,13,129,15],[131,11,131,12],[126,22,126,24],[128,13,128,15],[122,20,122,21],[122,22,122,24],[120,18,126,19],[124,11,124,12],[123,11,123,12],[123,13,123,15],[123,20,123,21],[123,22,123,24],[120,16,126,17],[124,20,124,21],[124,22,124,24],[120,20,120,21],[120,22,120,24],[121,11,121,12],[121,13,121,15],[121,20,121,21],[121,22,121,24],[127,11,127,15],[125,11,125,12],[125,13,125,15],[128,11,128,12],[127,22,127,24],[114,22,114,24],[115,20,115,21],[115,22,115,24],[103,16,103,19],[103,20,103,24],[116,20,116,21],[117,16,119,17],[116,22,116,24],[119,22,119,24],[112,22,112,24],[117,22,117,24],[118,20,118,21],[119,20,119,21],[117,18,119,19],[117,20,117,21],[113,22,113,24],[113,20,113,21],[118,22,118,24],[105,22,105,24],[106,20,106,21],[106,22,106,24],[108,20,108,21],[109,16,111,17],[104,18,104,19],[104,20,104,21],[104,22,104,24],[107,20,107,21],[107,22,107,24],[105,16,108,17],[105,20,105,21],[109,18,111,19],[109,20,109,21],[109,22,109,24],[110,20,110,21],[110,22,110,24],[111,20,111,21],[111,22,111,24],[108,22,108,24],[105,18,108,19],[104,16,104,17],[89,12,89,13],[90,12,90,13],[91,12,91,13],[92,12,92,13],[92,10,92,11],[91,10,91,11],[90,7,90,9],[91,7,91,9],[94,7,94,9],[93,12,93,13],[171,5,171,6],[172,5,172,6],[166,1,166,2],[167,1,167,2],[172,1,172,2],[174,1,174,2],[181,3,181,4],[177,3,177,4],[178,3,178,4],[179,3,179,4],[180,3,180,4],[173,3,173,4],[175,5,175,6],[175,1,175,2],[176,1,176,2],[176,5,176,6],[169,1,169,2],[170,1,170,2],[167,3,167,4],[168,3,168,4],[175,3,175,4],[176,3,176,4],[172,3,172,4],[109,6,109,10],[108,6,108,10],[119,6,119,10],[117,6,117,10],[112,3,116,3],[112,4,116,5],[119,11,119,12],[119,13,119,15],[170,5,170,6],[137,11,137,12],[124,13,124,15],[126,6,126,10],[126,11,126,12],[128,6,128,10],[113,13,113,15],[116,6,116,10],[116,11,116,12],[126,13,126,15],[110,11,110,12],[110,13,110,15],[110,6,110,10],[111,11,111,12],[111,13,111,15],[123,6,123,10],[135,11,135,12],[137,6,137,10],[136,6,136,10],[135,6,135,10],[150,1,150,13],[180,5,180,6],[155,1,155,2],[153,3,154,4],[155,3,155,4],[152,9,153,10],[139,6,139,10],[105,1,139,2],[134,6,134,10],[133,6,133,10],[134,3,139,3],[134,4,139,5],[178,1,178,2],[179,1,179,2],[180,1,180,2],[162,3,162,4],[108,11,108,12],[108,13,108,15],[107,13,107,15],[106,11,106,12],[174,5,174,6],[145,1,145,13],[138,6,138,10],[138,11,138,12],[138,13,138,15],[161,3,161,4],[173,1,173,2],[163,1,163,2],[164,1,164,2],[164,3,164,4],[156,1,156,2],[157,1,157,2],[158,1,158,2],[159,1,159,2],[160,1,160,2],[161,1,161,2],[163,3,163,4],[156,3,156,4],[157,3,157,4],[158,3,158,4],[159,3,159,4],[174,3,174,4],[171,3,171,4],[160,3,160,4],[173,5,173,6],[159,5,159,6],[41,3,41,6],[36,2,41,2],[44,3,44,6],[45,3,45,6],[46,3,46,6],[47,3,47,6],[171,1,171,2],[157,5,157,6],[163,5,163,6],[164,5,164,6],[161,5,161,6],[162,5,162,6],[160,5,160,6],[158,5,158,6],[165,1,165,2],[165,3,165,4],[166,3,166,4],[153,1,154,2],[168,1,168,2],[105,6,105,10],[111,6,111,10],[117,3,119,3],[39,7,39,8],[41,7,41,8],[43,7,43,8],[36,3,36,6],[37,3,37,6],[38,3,38,6],[36,7,36,8],[37,7,37,8],[38,7,38,8],[39,3,39,6],[40,3,40,6],[24,3,24,6],[26,3,26,6],[27,3,27,6],[28,3,28,6],[25,2,27,2],[24,7,24,8],[25,7,25,8],[26,7,26,8],[27,7,27,8],[25,3,25,6],[28,7,28,8],[28,2,29,2],[29,7,29,8],[29,3,29,6],[30,2,33,2],[30,7,30,8],[31,7,31,8],[33,7,33,8],[32,7,32,8],[30,3,30,6],[31,3,31,6],[32,3,32,6],[34,3,34,6],[33,3,33,6],[34,2,35,2],[34,7,34,8],[35,7,35,8],[35,3,35,6],[46,7,46,8],[47,7,47,8],[75,3,75,6],[76,3,76,6],[76,7,76,9],[54,1,54,10],[49,9,49,10],[69,10,71,11],[72,10,72,11],[75,10,75,11],[69,3,71,6],[72,3,72,6],[68,6,68,8],[73,7,73,9],[48,3,48,6],[51,3,51,6],[52,3,52,6],[69,2,71,2],[72,2,74,2],[73,3,73,6],[74,3,74,6],[68,10,68,12],[75,12,75,13],[76,12,76,13],[182,1,182,2],[182,5,182,6],[182,3,182,4],[155,5,155,6],[152,1,152,4],[152,5,154,6],[152,7,153,8],[42,2,47,2],[50,7,50,8],[51,7,51,8],[52,7,52,8],[42,7,42,8],[81,2,82,2],[81,3,81,6],[82,3,82,6],[74,7,74,9],[75,7,75,9],[42,3,42,6],[43,3,43,6],[49,3,49,6],[50,3,50,6],[75,2,76,2],[165,5,165,6],[156,5,156,6],[177,5,177,6],[178,5,178,6],[179,5,179,6],[17,1,18,12],[66,1,66,13],[24,9,24,10],[25,9,25,10],[26,9,26,10],[27,9,27,10],[28,9,28,10],[29,9,29,10],[30,9,30,10],[31,9,31,10],[32,9,32,10],[33,9,33,10],[34,9,34,10],[35,9,35,10],[36,9,36,10],[37,9,37,10],[50,9,50,10],[51,9,51,10],[52,9,52,10],[82,12,82,13],[48,9,48,10],[125,20,125,21],[125,22,125,24],[146,1,146,13],[38,9,38,10],[39,9,39,10],[41,9,41,10],[42,9,42,10],[43,9,43,10],[44,9,44,10],[45,9,45,10],[46,9,46,10],[47,9,47,10],[40,9,40,10],[69,7,71,9],[72,7,72,9],[44,7,44,8],[45,7,45,8],[85,10,85,11],[86,10,86,11],[88,10,88,11],[83,10,83,11],[84,10,84,11],[53,1,53,10],[82,7,82,9],[22,1,23,13],[105,11,105,15],[109,11,109,15],[112,11,112,15],[117,11,117,15],[120,11,120,15],[19,1,19,14],[143,1,143,13],[40,7,40,8],[60,1,60,13],[62,1,62,13],[56,1,56,13],[57,2,57,14],[84,7,84,9],[48,2,52,2],[48,7,48,8],[49,7,49,8],[83,2,88,2],[83,3,83,6],[84,3,84,6],[85,3,85,6],[86,3,86,6],[88,3,88,6],[85,7,85,9],[51,12,52,15],[49,12,49,15],[82,10,82,11],[103,1,104,2],[100,1,100,13],[101,1,101,13],[86,7,86,9],[88,7,88,9],[77,7,77,9],[99,7,99,9],[83,7,83,9],[78,7,78,9],[79,7,79,9],[80,7,80,9],[81,7,81,9],[77,3,77,6],[78,3,78,6],[79,3,79,6],[80,3,80,6],[98,3,98,6],[90,3,90,6],[91,3,91,6],[92,3,92,6],[93,3,93,6],[87,10,87,11],[127,4,133,5],[117,4,119,5],[125,6,125,10],[118,11,118,12],[118,13,118,15],[94,12,94,13],[95,12,95,13],[96,12,96,13],[122,11,122,12],[106,6,106,10],[95,3,95,6],[87,12,87,13],[103,6,104,10],[127,3,133,3],[132,6,132,10],[132,11,132,12],[132,13,132,15],[105,3,108,3],[105,4,108,5],[120,3,126,3],[120,4,126,5],[109,3,111,3],[109,4,111,5]]}
[]
[]
[]
[]
[]
[]
[]
[]
[]
[]
[]
[]
[]
[]
[]
[null,"SECCIÓN N° 8: ANÁLISIS TÉCNICO"]
[]
[null,"Este análisis sustenta la elección de una alternativa técnica de tamaño, localización y tecnología, en mérito a las características particulares de cada tipología de proyecto de inversión. "]
[]
[null,"8.1. ANÁLISIS DE TAMAÑO "]
[]
[]
[null,"Solo en los casos que sea posible analizar el tamaño, se debe describir ello la siguiente tabla:"]
[]
[null,"N°","Componente","Acciones (*)",null,null,null,"Tamaño",null,"Unidad"]
[null,1,"RECUPERACIÓN DE LA COBERTURA VEGETAL NATIVA DEL ECOSISTEMA PRINCIPAL","REVEGETACIÓN CON ESPECIES NATIVAS",null,null,null,null,null,{"$f":"IF(D26=\"\",\"\",'COSTOS UNITARIOS'!R12)","v":"HA"}]
[null,null,null,"INSTALACIÓN DE CERCOS EXCLUIDORES",null,null,null,null,null,{"$f":"IF(D27=\"\",\"\",'COSTOS UNITARIOS'!R15)","v":"ML"}]
[null,null,null,"OTRO:",null,null,null,null,null,{"$f":"IF(D28=\"\",\"\",'COSTOS UNITARIOS'!R19)","v":0}]
[null,2,"RECUPERACIÓN DE LAS CARACTERÍSTICAS DE LA TURBA DEL ECOSISTEMA PRINCIPAL","REVEGETACIÓN CON ESPECIES NATIVAS",null,null,null,null,null,{"$f":"IF(D29=\"\",\"\",'COSTOS UNITARIOS'!R22)","v":"HA"}]
[null,null,null,"OTRO:",null,null,null,null,null,{"$f":"IF(D30=\"\",\"\",'COSTOS UNITARIOS'!R25)","v":0}]
[null,3,"RECUPERACIÓN DE LA COBERTURA VEGETAL DE LOS ECOSISTEMAS ASOCIADOS","REFORESTACIÓN CON ESPECIES NATIVAS",null,null,null,null,null,{"$f":"IF(D31=\"\",\"\",'COSTOS UNITARIOS'!R28)","v":"HA"}]
[null,null,null,"REVEGETACIÓN CON ESPECIES NATIVAS",null,null,null,null,null,{"$f":"IF(D32=\"\",\"\",'COSTOS UNITARIOS'!R34)","v":"HA"}]
[null,null,null,"INSTALACIÓN DE CERCOS EXCLUIDORES",null,null,null,null,null,{"$f":"IF(D33=\"\",\"\",'COSTOS UNITARIOS'!R37)","v":"ML"}]
[null,null,null,"OTRO:",null,null,null,null,null,{"$f":"IF(D34=\"\",\"\",'COSTOS UNITARIOS'!R41)","v":0}]
[null,4,"RECUPERACIÓN DE LAS CARACTERÍSTICAS DEL SUELO DEL ECOSISTEMA ASOCIADO","ENRIQUECIMIENTO DE SUELOS",null,null,null,null,null,{"$f":"IF(D35=\"\",\"\",'COSTOS UNITARIOS'!R44)","v":"HA"}]
[null,null,null,"OTRO:",null,null,null,null,null,{"$f":"IF(D36=\"\",\"\",'COSTOS UNITARIOS'!R49)","v":0}]
[null,5,"ADAPTACIÓN A LOS REGÍMENES DE PRECIPITACIÓN Y TEMPERATURAS","REPARACIÓN DEL CANAL AMUNADOR",null,null,null,null,null,{"$f":"IF(D37=\"\",\"\",'COSTOS UNITARIOS'!R52)","v":"HA"}]
[null,null,null,"REPARACIÓN DEL CANAL DE MAMANTEO",null,null,null,null,null,{"$f":"IF(D38=\"\",\"\",'COSTOS UNITARIOS'!R56)","v":"ML"}]
[null,null,null,"CONSTRUCCIÓN DE ZANJAS DE INFILTRACIÓN",null,null,null,null,null,{"$f":"IF(D39=\"\",\"\",'COSTOS UNITARIOS'!R60)","v":"ML"}]
[null,null,null,"INSTALACIÓN DE QOCHAS",null,null,null,null,null,{"$f":"IF(D40=\"\",\"\",'COSTOS UNITARIOS'!R64)","v":"UNIDAD"}]
[null,null,null,"CONSTRUCCIÓN DE TERRAZAS DE FORMACIÓN DE SUELOS",null,null,null,null,null,{"$f":"IF(D41=\"\",\"\",'COSTOS UNITARIOS'!R66)","v":"HA"}]
[null,null,null,"OTRO:",null,null,null,null,null,{"$f":"IF(D42=\"\",\"\",'COSTOS UNITARIOS'!R71)","v":0}]
[null,6,"ADECUADAS PRÁCTICAS DE MANEJO DEL ECOSISTEMA","CAPACITACIÓN EN GESTIÓN INTEGRADA DE RECURSOS HÍDRICOS CON ENFOQUE DE CUENCA",null,null,null,null,null,{"$f":"IF(D43=\"\",\"\",'COSTOS UNITARIOS'!R74)","v":"EVENTO"}]
[null,null,null,"ASISTENCIA TÉCNICA EN EL MANEJO DE ECOSISTEMAS DE INTERÉS HÍDRICO",null,null,null,null,null,{"$f":"IF(D44=\"\",\"\",'COSTOS UNITARIOS'!R77)","v":"EVENTO"}]
[null,null,null,"CAPACITACIÓN EN BUENAS PRÁCTICAS PARA LA ADAPTACIÓN AL CAMBIO CLIMÁTICO Y GESTIÓN DE RIESGOS",null,null,null,null,null,{"$f":"IF(D45=\"\",\"\",'COSTOS UNITARIOS'!R80)","v":"TALLER"}]
[null,null,null,"SENSIBILIZACIÓN RELACIONADA A LA RECUPERACIÓN DEL SERVICIO ECOSISTÉMICO DE REGULACIÓN HÍDRICA",null,null,null,null,null,{"$f":"IF(D46=\"\",\"\",'COSTOS UNITARIOS'!R82)","v":"TALLER"}]
[null,null,null,"INTERCAMBIO DE EXPERIENCIAS RELACIONADAS A LA RECUPERACIÓN DEL SERVICIO ECOSISTÉMICO DE REGULACIÓN HÍDRICA",null,null,null,null,null,{"$f":"IF(D47=\"\",\"\",'COSTOS UNITARIOS'!R84)","v":"EVENTO"}]
[null,null,null,"OTRO:",null,null,null,null,null,{"$f":"IF(D48=\"\",\"\",'COSTOS UNITARIOS'!R86)","v":0}]
[null,7,"ADECUADAS CAPACIDADES DE LAS ENTIDADES A CARGO DE LA GESTIÓN DEL ECOSISTEMA","CAPACITACIÓN A FUNCIONARIOS PÚBLICOS SOBRE LA GESTIÓN INTEGRADA DEL RECURSO HÍDRICO CON ENFOQUE DE CUENCA",null,null,null,null,null,{"$f":"IF(D49=\"\",\"\",'COSTOS UNITARIOS'!R89)","v":"TALLER"}]
[null,null,null,"CAPACITACIÓN A FUNCIONARIOS PÚBLICOS SOBRE LAS MEDIDAS DE ADAPTACIÓN EN UN CONTEXTO DE CAMBIO CLIMÁTICO EN LA GESTIÓN INTEGRADA DE LOS RECURSOS HÍDRICOS",null,null,null,null,null,{"$f":"IF(D50=\"\",\"\",'COSTOS UNITARIOS'!R91)","v":"TALLER"}]
[null,null,null,"DESARROLLO DE CAPACIDADES PARA EL MONITOREO Y SEGUIMIENTO DE LOS ECOSISTEMAS DE INTERÉS HÍDRICO Y EL SERVICIO ECOSISTÉMICO DE REGULACIÓN HÍDRICA",null,null,null,null,null,{"$f":"IF(D51=\"\",\"\",'COSTOS UNITARIOS'!R93)","v":"TALLER"}]
[null,null,null,"INTERCAMBIO DE EXPERIENCIAS SOBRE LA GESTIÓN INTEGRADA DEL RECURSO HÍDRICO CON ENFOQUE DE CUENCA",null,null,null,null,null,{"$f":"IF(D52=\"\",\"\",'COSTOS UNITARIOS'!R95)","v":"EVENTO"}]
[null,null,null,"OTRO:",null,null,null,null,null,{"$f":"IF(D53=\"\",\"\",'COSTOS UNITARIOS'!R97)","v":0}]
[null,"(*) La naturaleza de las acciones asociadas a los componentes del N° 1 al N° 5 corresponden a \"Adecuación\" debido a que el factor de producción es \"Infraestructura Natural\", mientras que las acciones asociadas a los componentes N° 6 y N° 7 tienen como naturaleza \"Implementación\" debido a que el factor de producción es \"Intangible\". Estas consideraciones han sido desarrolladas en base a la Tabla 2.22 de la \"Guía General para la Identificación, Formulación y Evaluación de Proyectos de Inversión\" del Invierte.pe."]
[null,"Nota: Como parte de las acciones necesarias para lograr las \"Adecuadas capacidades de las entidades a cargo de la gestión del ecosistema\" se tiene que considerar la \"Instalación del sistema de seguimiento y monitoreo del servicio ecosistémico de regulación hídrica\", la cual comprende como mínimo la construcción de un vertedero en la salida de la cuenca y la instalación de un sensor de nivel de agua. Tomar como referencia lo indicado en la pestaña \"Comunicación técnica\"."]
[]
[null,"8.2. ANÁLISIS DE LOCALIZACIÓN "]
[]
[]
[]
[null,"8.2.1. Mapa de Identificación de intervenciones"]
[]
[null,"ADJUNTAR EN LOS ANEXOS EL MAPA DEL ÁREA DE INTERVENCIONES"]
[]
[]
[]
[null,"8.3. ANÁLISIS DE TECNOLOGÍA "]
[]
[]
[null,"N°","Componentes","Acciones",null,null,null,"Tipo de Factor productivo",null,null,"Activo estratégicos esenciales",null,"Detalle"]
[]
[]
[null,1,"RECUPERACIÓN DE LA COBERTURA VEGETAL NATIVA DEL ECOSISTEMA PRINCIPAL","REVEGETACIÓN CON ESPECIES NATIVAS",null,null,null,"Infraestructura Natural",null,null,"Superficie revegetada",null,{"$f":"IF($D$73=\"\",\"\",CONCATENATE(datos!K191,\", \",datos!K193))","v":"SIEMBRA DE ESPECIES HERBÁCEAS SELECCIONADAS, LABORES CULTURALES A ESPECIES HERBÁCEAS"}]
[null,null,null,"INSTALACIÓN DE CERCOS EXCLUIDORES",null,null,null,"Infraestructura",null,null,"Excluidores con materiales naturales",null,{"$f":"IF($D$74=\"\",\"\",CONCATENATE(datos!D191,\", \",datos!D193,\", \",datos!D195))","v":"TRAZO Y MARCACIÓN, APERTURA DE HOYOS, TRASLADO DE PLANTADO DE POSTES"}]
[null,null,null,"OTRO:"]
[null,2,"RECUPERACIÓN DE LAS CARACTERÍSTICAS DE LA TURBA DEL ECOSISTEMA PRINCIPAL","REVEGETACIÓN CON ESPECIES NATIVAS",null,null,null,"Infraestructura Natural",null,null,"Superficie revegetada",null,{"$f":"IF($D$76=\"\",\"\",CONCATENATE(datos!K191,\", \",datos!K193))","v":"SIEMBRA DE ESPECIES HERBÁCEAS SELECCIONADAS, LABORES CULTURALES A ESPECIES HERBÁCEAS"}]
[null,null,null,"OTRO:"]
[null,3,"RECUPERACIÓN DE LA COBERTURA VEGETAL DE LOS ECOSISTEMAS ASOCIADOS","REFORESTACIÓN CON ESPECIES NATIVAS",null,null,null,"Infraestructura Natural",null,null,"Superficie reforestada ",null,{"$f":"IF($D$78=\"\",\"\",CONCATENATE(datos!J191,\", \",datos!J193,\", \",datos!J195,\",\",datos!J197,\",\",datos!J199))","v":"PLANIFICACIÓN DE ESPECIES A ADQUIRIR O PRODUCIR, IMPLEMENTACIÓN DE VIVEROS FORESTALES, LABORES CULTURALES EN PRODUCCIÓN DE PLANTONES,PLANTACIÓN PROPIAMENTE DICHA,LABORES CULTURALES A PLANTONES INSTALADOS"}]
[null,null,null,"REVEGETACIÓN CON ESPECIES NATIVAS",null,null,null,"Infraestructura Natural",null,null,"Superficie revegetada",null,{"$f":"IF($D$79=\"\",\"\",CONCATENATE(datos!K191,\", \",datos!K193))","v":"SIEMBRA DE ESPECIES HERBÁCEAS SELECCIONADAS, LABORES CULTURALES A ESPECIES HERBÁCEAS"}]
[null,null,null,"INSTALACIÓN DE CERCOS EXCLUIDORES",null,null,null,"Infraestructura",null,null,"Excluidores con materiales naturales",null,{"$f":"IF($D$80=\"\",\"\",CONCATENATE(datos!L191,\", \",datos!L193,\", \",datos!L195))","v":"TRAZO Y MARCACIÓN, APERTURA DE HOYOS, TRASLADO DE PLANTADO DE POSTES"}]
[null,null,null,"OTRO:"]
[null,4,"RECUPERACIÓN DE LAS CARACTERÍSTICAS DEL SUELO DEL ECOSISTEMA ASOCIADO","ENRIQUECIMIENTO DE SUELOS",null,null,null,"Infraestructura Natural",null,null,"Superficie con suelos retenidos o recuperados",null,{"$f":"IF($D$82=\"\",\"\",CONCATENATE(datos!N191,\", \",datos!N193,\",\",datos!N195,\",\",datos!N197))","v":"DESHIERBO, ABONAMIENTO POR FUENTES MINERALES,ABONAMIENTO ORGÁNICO DEL ÁREA,INSTALACIÓN DE VEGETACIÓN PARA ENRIQUECIMIENTO DEL SUELO"}]
[null,null,null,"OTRO:"]
[null,5,"ADAPTACIÓN A LOS REGÍMENES DE PRECIPITACIÓN Y TEMPERATURAS","REPARACIÓN DEL CANAL AMUNADOR",null,null,null,"Infraestructura Natural",null,null,"Diques o reservorios de retención de aguas rústicas",null,{"$f":"IF($D$84=\"\",\"\",CONCATENATE(datos!P191,\", \",datos!P193,\",\",datos!P195))","v":"CONSTRUCCIÓN DE DIQUE Y ESTRUCTURA DE CAPTACIÓN, MEJORAMIENTO DEL CANAL AMUNADOR,INSTALACIÓN DE ÁREA DE PROTECCIÓN"}]
[null,null,null,"REPARACIÓN DEL CANAL DE MAMANTEO",null,null,null,"Infraestructura Natural",null,null,"Superficie de cobertura vegetal para proteger canales de mamanteo",null,{"$f":"IF($D$85=\"\",\"\",CONCATENATE(datos!Q191,\", \",datos!Q193,\", \",datos!Q195))","v":"DESCOLMATACIÓN DE CANALES, RECONSTRUCCIÓN E IMPLEMENTACIÓN DE CANALES DE MAMANTEO, INSTALACIÓN DE MEDIDAS DE PROTECCIÓN"}]
[null,null,null,"CONSTRUCCIÓN DE ZANJAS DE INFILTRACIÓN",null,null,null,"Infraestructura Natural",null,null,"Zanjas de infiltración con materiales naturales",null,{"$f":"IF($D$86=\"\",\"\",CONCATENATE(datos!R191,\", \",datos!R193,\", \",datos!R195))","v":"TRAZO, NIVELES Y REPLANTE PRELIMINAR, EXCAVACIÓN DE ZANJAS DE INFILTRACIÓN, COMPACTACIÓN DEL TERRENO"}]
[null,null,null,"INSTALACIÓN DE QOCHAS",null,null,null,"Infraestructura Natural",null,null,"Diques o reservorios de retención de aguas rústicas",null,{"$f":"IF($D$87=\"\",\"\",datos!S191)","v":"CONSTRUCCIÓN DE DIQUES"}]
[null,null,null,"CONSTRUCCIÓN DE TERRAZAS DE FORMACIÓN DE SUELOS",null,null,null,"Infraestructura Natural",null,null,"Terrazas de formación de suelos con materiales naturales",null,{"$f":"IF(D88=\"\",\"\",CONCATENATE(datos!O191,\", \",datos!O192,\", \",datos!O193,\",\",datos!O194))","v":"TRAZO Y MARCACIÓN, REMOCIÓN DE TIERRA FÉRTIL, COMPACTACIÓN DEL SUELO DE LA TERRAZA,EMPAREJAMIENTO DE LA TERRAZA"}]
[null,null,null,"OTRO:"]
[null,6,"ADECUADAS PRÁCTICAS DEL MANEJO DEL ECOSISTEMA","CAPACITACIÓN EN GESTIÓN INTEGRADA DE RECURSOS HÍDRICOS CON ENFOQUE DE CUENCA",null,null,null,"Intangible",null,null,null,null,{"$f":"IF($D$90=\"\",\"\",CONCATENATE(datos!T191,\", \",datos!T193))","v":"COORDINACIÓN CON ORGANIZACIONES Y COMITÉS DE LA COMUNIDAD EXISTENTE, TALLERES DE CAPACITACIÓN A ORGANIZACIONES Y COMITÉS DE LA COMUNIDAD EXISTENTE"}]
[null,null,null,"ASISTENCIA TÉCNICA EN EL MANEJO DE ECOSISTEMAS DE INTERÉS HÍDRICO",null,null,null,"Intangible",null,null,null,null,{"$f":"IF($D$91=\"\",\"\",CONCATENATE(datos!U191,\", \",datos!U193))","v":"COORDINACIÓN CON ORGANIZACIONES Y COMITÉS DE LA COMUNIDAD, TALLERES DE CAPACITACIÓN A ORGANIZACIONES Y COMITÉS DE LA COMUNIDAD EXISTENTE"}]
[null,null,null,"CAPACITACIÓN EN BUENAS PRÁCTICAS PARA LA ADAPTACIÓN AL CAMBIO CLIMÁTICO Y GESTIÓN DE RIESGOS",null,null,null,"Intangible",null,null,null,null,{"$f":"IF($D$92=\"\",\"\",CONCATENATE(datos!V191))","v":"TALLERES DE CAPACITACIÓN EN ADAPTACIÓN AL CAMBIO CLIMÁTICO"}]
[null,null,null,"SENSIBILIZACIÓN RELACIONADA A LA RECUPERACIÓN DEL SERVICIO ECOSISTÉMICO DE REGULACIÓN HÍDRICA",null,null,null,"Intangible",null,null,null,null,{"$f":"IF($D$93=\"\",\"\",CONCATENATE(datos!W191))","v":"CAMPAÑAS DE SENSIBILIZACIÓN"}]
[null,null,null,"INTERCAMBIO DE EXPERIENCIAS RELACIONADA A LA RECUPERACIÓN DEL SERVICIO ECOSISTÉMICO DE REGULACIÓN HÍDRICA",null,null,null,"Intangible",null,null,null,null,{"$f":"IF($D$94=\"\",\"\",CONCATENATE(datos!X191))","v":"REALIZACIÓN DE PASANTÍAS"}]
[null,null,null,"OTRO:"]
[null,7,"ADECUADAS CAPACIDADES DE LAS ENTIDADES A CARGO DE LA GESTIÓN DEL ECOSISTEMA","CAPACITACIÓN A FUNCIONARIOS PÚBLICOS SOBRE LA GESTIÓN INTEGRADA DEL RECURSO HÍDRICO CON ENFOQUE DE CUENCA",null,null,null,"Intangible",null,null,null,null,{"$f":"IF($D$96=\"\",\"\",CONCATENATE(datos!Y191))","v":"TALLERES DE CAPACITACIÓN SOBRE GESTIÓN DEL ECOSISTEMA"}]
[null,null,null,"CAPACITACIÓN A FUNCIONARIOS PÚBLICOS SOBRE LAS MEDIDAS DE ADAPTACIÓN EN UN CONTEXTO DE CAMBIO CLIMÁTICO EN LA GESTIÓN INTEGRADA DE LOS RECURSOS HÍDRICOS",null,null,null,"Intangible",null,null,null,null,{"$f":"IF($D$97=\"\",\"\",CONCATENATE(datos!Z191))","v":"TALLERES DE CAPACITACIÓN SOBRE CAMBIO CLIMÁTICO"}]
[null,null,null,"DESARROLLO DE CAPACIDADES PARA EL MONITOREO Y SEGUIMIENTO DE LOS ECOSISTEMAS DE INTERÉS HÍDRICO Y EL SERVICIO ECOSISTÉMICO DE REGULACIÓN HÍDRICA",null,null,null,"Intangible",null,null,null,null,{"$f":"IF($D$98=\"\",\"\",CONCATENATE(datos!AA191))","v":"TALLERES DE CAPACITACIÓN SOBRE MONITOREO Y SEGUIMIENTO"}]
[null,null,null,"INTERCAMBIO DE EXPERIENCIAS SOBRE LA GESTIÓN INTEGRADA DEL RECURSO HÍDRICO CON ENFOQUE DE CUENCA",null,null,null,"Intangible",null,null,null,null,{"$f":"IF($D$99=\"\",\"\",CONCATENATE(datos!AB191))","v":"REALIZACIÓN DE PASANTÍAS"}]
[null,null,null,"OTRO:"]
[null,"(*) La naturaleza de las acciones asociadas a los componentes del N° 1 al N° 5 corresponden a \"Adecuación\" debido a que el factor de producción es \"Infraestructura Natural\", mientras que las acciones asociadas a los componentes N° 6 y N° 7 tienen como naturaleza \"Implementación\" debido a que el factor de producción es \"Intangible\". Estas consideraciones han sido desarrolladas en base a la Tabla 2.22 de la \"Guía General para la Identificación, Formulación y Evaluación de Proyectos de Inversión\" del Invierte.pe."]
[null,"Nota: Como parte de las acciones necesarias para lograr las \"Adecuadas capacidades de las entidades a cargo de la gestión del ecosistema\" se tiene que considerar la \"Instalación del sistema de seguimiento y monitoreo del servicio ecosistémico de regulación hídrica\", la cual comprende como mínimo la construcción de un vertedero en la salida de la cuenca y la instalación de un sensor de nivel de agua. Tomar como referencia lo indicado en la pestaña \"Comunicación técnica\"."]
[]
[null,"INDICADOR DEL PROYECTO",null,"INDICADOR DE PRODUCTO",null,null,"DESCRIPCIÓN DE ACCIONES",null,null,null,null,"Unidad Física",null,null,null,null,"EXPEDIENTE TÉCNICO O DOCUMENTO EQUIVALENTE",null,null,null,"EJECUCIÓN FÍSICA"]
[null,null,null,null,null,null,null,null,null,null,null,"Cantidad",null,"Unidad",null,null,"FECHA INICIO",null,"FECHA TÉRMINO",null,"FECHA INICIO",null,"FECHA TÉRMINO"]
[null,{"$f":"CONCATENATE('4.UNIDAD PRODUCTORA'!O58,\" HECTÁREAS DE ECOSISTEMAS DE INTERÉS HÍDRICO\",\" RECUPERADAS\")","v":" HECTÁREAS DE ECOSISTEMAS DE INTERÉS HÍDRICO RECUPERADAS"},null,{"$f":"'9.COSTOS '!K93","v":0},{"$f":"IF(C73=\"\",\"\",datos!C109)","v":"HECTÁREAS DE COBERTURA VEGETAL INCREMENTADAS DEL ECOSISTEMA PRINCIPAL"},null,{"$f":"C73","v":"RECUPERACIÓN DE LA COBERTURA VEGETAL NATIVA DEL ECOSISTEMA PRINCIPAL"}]
[null,null,null,null,null,null,{"$f":"D73","v":"REVEGETACIÓN CON ESPECIES NATIVAS"},null,null,null,null,{"$f":"+H26","v":0},null,{"$f":"+J26","v":"HA"}]
[null,null,null,null,null,null,{"$f":"D74","v":"INSTALACIÓN DE CERCOS EXCLUIDORES"},null,null,null,null,{"$f":"+H27","v":0},null,{"$f":"+J27","v":"ML"}]
[null,null,null,null,null,null,{"$f":"D75","v":"OTRO:"},null,null,null,null,{"$f":"+H28","v":0},null,{"$f":"+J28","v":0}]
[null,null,null,{"$f":"'9.COSTOS '!K94","v":0},{"$f":"IF(C76=\"\",\"\",datos!C110)","v":"HECTÁREAS DE LA ESTRUCTURA DE LA TURBA RECUPERADA DEL ECOSISTEMA PRINCIPAL"},null,{"$f":"C76","v":"RECUPERACIÓN DE LAS CARACTERÍSTICAS DE LA TURBA DEL ECOSISTEMA PRINCIPAL"}]
[null,null,null,null,null,null,{"$f":"D76","v":"REVEGETACIÓN CON ESPECIES NATIVAS"},null,null,null,null,{"$f":"+H29","v":0},null,{"$f":"+J29","v":"HA"}]
[null,null,null,null,null,null,{"$f":"D77","v":"OTRO:"},null,null,null,null,{"$f":"+H30","v":0},null,{"$f":"+J30","v":0}]
[null,null,null,{"$f":"'9.COSTOS '!K95","v":0},{"$f":"IF(C78=\"\",\"\",datos!C112)","v":"HECTÁREAS DE COBERTURA VEGETAL INCREMENTADAS DE LOS ECOSISTEMAS ASOCIADOS"},null,{"$f":"C78","v":"RECUPERACIÓN DE LA COBERTURA VEGETAL DE LOS ECOSISTEMAS ASOCIADOS"}]
[null,null,null,null,null,null,{"$f":"D78","v":"REFORESTACIÓN CON ESPECIES NATIVAS"},null,null,null,null,{"$f":"+H31","v":0},null,{"$f":"+J31","v":"HA"}]
[null,null,null,null,null,null,{"$f":"D79","v":"REVEGETACIÓN CON ESPECIES NATIVAS"},null,null,null,null,{"$f":"+H32","v":0},null,{"$f":"+J32","v":"HA"}]
[null,null,null,null,null,null,{"$f":"D80","v":"INSTALACIÓN DE CERCOS EXCLUIDORES"},null,null,null,null,{"$f":"+H33","v":0},null,{"$f":"+J33","v":"ML"}]
[null,null,null,null,null,null,{"$f":"D81","v":"OTRO:"},null,null,null,null,{"$f":"+H34","v":0},null,{"$f":"+J34","v":0}]
[null,null,null,{"$f":"'9.COSTOS '!K96","v":0},{"$f":"IF(C82=\"\",\"\",datos!C113)","v":"HECTÁREAS DE LA ESTRUCTURA DEL SUELO RECUPERADA DE LOS ECOSISTEMAS ASOCIADOS"},null,{"$f":"C82","v":"RECUPERACIÓN DE LAS CARACTERÍSTICAS DEL SUELO DEL ECOSISTEMA ASOCIADO"}]
[null,null,null,null,null,null,{"$f":"D82","v":"ENRIQUECIMIENTO DE SUELOS"},null,null,null,null,{"$f":"+H35","v":0},null,{"$f":"+J35","v":"HA"}]
[null,null,null,null,null,null,{"$f":"D83","v":"OTRO:"},null,null,null,null,{"$f":"+H36","v":0},null,{"$f":"+J36","v":0}]
[null,null,null,{"$f":"'9.COSTOS '!K97","v":0},{"$f":"IF(C84=\"\",\"\",datos!C114)","v":"NÚMERO DE MEDIDAS DE ADAPTACIÓN AL RÉGIMEN DE PRECIPITACIONES Y TEMPERATURAS"},null,{"$f":"C84","v":"ADAPTACIÓN A LOS REGÍMENES DE PRECIPITACIÓN Y TEMPERATURAS"}]
[null,null,null,null,null,null,{"$f":"D84","v":"REPARACIÓN DEL CANAL AMUNADOR"},null,null,null,null,{"$f":"+H37","v":0},null,{"$f":"+J37","v":"HA"}]
[null,null,null,null,null,null,"REPARACIÓN DEL CANAL DE MAMANTEO",null,null,null,null,0,null,"ML"]
[null,null,null,null,null,null,"CONSTRUCCIÓN DE ZANJAS DE INFILTRACIÓN",null,null,null,null,0,null,"ML"]
[null,null,null,null,null,null,"INSTALACIÓN DE QOCHAS",null,null,null,null,0,null,"UNIDAD"]
[null,null,null,null,null,null,"CONSTRUCCIÓN DE TERRAZAS DE FORMACIÓN DE SUELOS",null,null,null,null,0,null,"HA"]
[null,null,null,null,null,null,"OTRO:",null,null,null,null,0,null,0]
[null,null,null,{"$f":"'9.COSTOS '!K98","v":0},{"$f":"IF(C90=\"\",\"\",datos!C115)","v":"POBLADORES CON ADECUADAS CAPACIDADES EN PRÁCTICAS DE MANEJO DE LOS ECOSISTEMAS DE INTERÉS HÍDRICO"},null,{"$f":"C90","v":"ADECUADAS PRÁCTICAS DEL MANEJO DEL ECOSISTEMA"}]
[null,null,null,null,null,null,{"$f":"D90","v":"CAPACITACIÓN EN GESTIÓN INTEGRADA DE RECURSOS HÍDRICOS CON ENFOQUE DE CUENCA"},null,null,null,null,{"$f":"+H43","v":0},null,{"$f":"+J43","v":"EVENTO"}]
[null,null,null,null,null,null,"ASISTENCIA TÉCNICA EN EL MANEJO DE ECOSISTEMAS DE INTERÉS HÍDRICO",null,null,null,null,0,null,"EVENTO"]
[null,null,null,null,null,null,"CAPACITACIÓN EN BUENAS PRÁCTICAS PARA LA ADAPTACIÓN AL CAMBIO CLIMÁTICO Y GESTIÓN DE RIESGOS",null,null,null,null,0,null,"TALLER"]
[null,null,null,null,null,null,"SENSIBILIZACIÓN RELACIONADA A LA RECUPERACIÓN DEL SERVICIO ECOSISTÉMICO DE REGULACIÓN HÍDRICA",null,null,null,null,0,null,"TALLER"]
[null,null,null,null,null,null,"INTERCAMBIO DE EXPERIENCIAS RELACIONADA A LA RECUPERACIÓN DEL SERVICIO ECOSISTÉMICO DE REGULACIÓN HÍDRICA",null,null,null,null,0,null,"EVENTO"]
[null,null,null,null,null,null,"OTRO:",null,null,null,null,0,null,0]
[null,null,null,{"$f":"'9.COSTOS '!K99","v":0},{"$f":"IF(C96=\"\",\"\",datos!C116)","v":"N° DE ÁREAS U ÓRGANOS ENCARGADOS DE LA GESTIÓN DEL ECOSISTEMA DE INTERÉS HÍDRICO CON ADECUADAS CAPACIDADES EN GESTIÓN DEL ECOSISTEMA"},null,{"$f":"C96","v":"ADECUADAS CAPACIDADES DE LAS ENTIDADES A CARGO DE LA GESTIÓN DEL ECOSISTEMA"}]
[null,null,null,null,null,null,{"$f":"D96","v":"CAPACITACIÓN A FUNCIONARIOS PÚBLICOS SOBRE LA GESTIÓN INTEGRADA DEL RECURSO HÍDRICO CON ENFOQUE DE CUENCA"},null,null,null,null,{"$f":"+H49","v":0},null,{"$f":"+J49","v":"TALLER"}]
[null,null,null,null,null,null,{"$f":"D97","v":"CAPACITACIÓN A FUNCIONARIOS PÚBLICOS SOBRE LAS MEDIDAS DE ADAPTACIÓN EN UN CONTEXTO DE CAMBIO CLIMÁTICO EN LA GESTIÓN INTEGRADA DE LOS RECURSOS HÍDRICOS"},null,null,null,null,{"$f":"+H50","v":0},null,{"$f":"+J50","v":"TALLER"}]
[null,null,null,null,null,null,{"$f":"D98","v":"DESARROLLO DE CAPACIDADES PARA EL MONITOREO Y SEGUIMIENTO DE LOS ECOSISTEMAS DE INTERÉS HÍDRICO Y EL SERVICIO ECOSISTÉMICO DE REGULACIÓN HÍDRICA"},null,null,null,null,{"$f":"+H51","v":0},null,{"$f":"+J51","v":"TALLER"}]
[null,null,null,null,null,null,{"$f":"D99","v":"INTERCAMBIO DE EXPERIENCIAS SOBRE LA GESTIÓN INTEGRADA DEL RECURSO HÍDRICO CON ENFOQUE DE CUENCA"},null,null,null,null,{"$f":"+H52","v":0},null,{"$f":"+J52","v":"EVENTO"}]
[null,null,null,null,null,null,{"$f":"D100","v":"OTRO:"},null,null,null,null,{"$f":"+H53","v":0},null,{"$f":"+J53","v":0}]
[]
[]
[]
[null,"8.4. IDENTIFICACIÓN DE MEDIDAS DE REDUCCIÓN DEL RIESGO DE DESASTRES"]
[]
[null,"Descripción de las medidas de reducción del riesgo de desastres (asociadas al análisis de la exposición y fragilidad de la UP sujeta de intervención y de la resiliencia de la población afectada)."]
[]
[]
[]
[]
[null,"8.5. METAS FÍSICAS DE LOS ACTIVOS QUE SE BUSCAN CREAR O INTERVENIR CON EL PROYECTO*"]
[]
[null,"Acción sobre el activo",null,null,null,"Tipo de factor productivo",null,"Unidad Física"]
[null,"Acción",null,"Activos estratégicos esenciales"]
[null,null,null,null,null,null,null,"Unidad de \nmedida","Cantidad"]
[null,{"$f":"D73","v":"REVEGETACIÓN CON ESPECIES NATIVAS"},null,{"$f":"K73","v":"Superficie revegetada"},null,{"$f":"H73","v":"Infraestructura Natural"},null,{"$f":"N107","v":"HA"},{"$f":"L107","v":0}]
[null,"INSTALACIÓN DE CERCOS EXCLUIDORES",null,"Excluidores con materiales naturales",null,{"$f":"H74","v":"Infraestructura"},null,{"$f":"N108","v":"ML"},{"$f":"L108","v":0}]
[null,"OTRO:",null,0,null,0,null,{"$f":"N109","v":0},{"$f":"L109","v":0}]
[null,"REVEGETACIÓN CON ESPECIES NATIVAS",null,"Superficie revegetada",null,"Infraestructura Natural",null,{"$f":"+N111","v":"HA"},{"$f":"+L111","v":0}]
[null,"OTRO:",null,0,null,0,null,{"$f":"+N112","v":0},{"$f":"+L112","v":0}]
[null,"REFORESTACIÓN CON ESPECIES NATIVAS",null,"Superficie reforestada ",null,"Infraestructura Natural",null,{"$f":"N114","v":"HA"},{"$f":"L114","v":0}]
[null,"REVEGETACIÓN CON ESPECIES NATIVAS",null,"Superficie revegetada",null,"Infraestructura Natural",null,{"$f":"N115","v":"HA"},{"$f":"L115","v":0}]
[null,"INSTALACIÓN DE CERCOS EXCLUIDORES",null,"Excluidores con materiales naturales",null,"Infraestructura",null,{"$f":"N116","v":"ML"},{"$f":"L116","v":0}]
[null,"OTRO:",null,0,null,0,null,{"$f":"N117","v":0},{"$f":"L117","v":0}]
[null,"ENRIQUECIMIENTO DE SUELOS",null,"Superficie con suelos retenidos o recuperados",null,"Infraestructura Natural",null,{"$f":"+N119","v":"HA"},{"$f":"+L119","v":0}]
[null,"OTRO:",null,0,null,0,null,{"$f":"+N120","v":0},{"$f":"+L120","v":0}]
[null,"REPARACIÓN DEL CANAL AMUNADOR",null,"Diques o reservorios de retención de aguas rústicas",null,"Infraestructura Natural",null,{"$f":"N122","v":"HA"},{"$f":"L122","v":0}]
[null,"REPARACIÓN DEL CANAL DE MAMANTEO",null,"Superficie de cobertura vegetal para proteger canales de mamanteo",null,"Infraestructura Natural",null,"ML",0]
[null,"CONSTRUCCIÓN DE ZANJAS DE INFILTRACIÓN",null,"Zanjas de infiltración con materiales naturales",null,"Infraestructura Natural",null,"ML",0]
[null,"INSTALACIÓN DE QOCHAS",null,"Diques o reservorios de retención de aguas rústicas",null,"Infraestructura Natural",null,"UNIDAD",0]
[null,"CONSTRUCCIÓN DE TERRAZAS DE FORMACIÓN DE SUELOS",null,"Terrazas de formación de suelos con materiales naturales",null,"Infraestructura Natural",null,"HA",0]
[null,"OTRO:",null,0,null,0,null,0,0]
[null,"CAPACITACIÓN EN GESTIÓN INTEGRADA DE RECURSOS HÍDRICOS CON ENFOQUE DE CUENCA",null,0,null,"Intangible",null,{"$f":"N129","v":"EVENTO"},{"$f":"L129","v":0}]
[null,"ASISTENCIA TÉCNICA EN EL MANEJO DE ECOSISTEMAS DE INTERÉS HÍDRICO",null,0,null,"Intangible",null,"EVENTO",0]
[null,"CAPACITACIÓN EN BUENAS PRÁCTICAS PARA LA ADAPTACIÓN AL CAMBIO CLIMÁTICO Y GESTIÓN DE RIESGOS",null,0,null,"Intangible",null,"TALLER",0]
[null,"SENSIBILIZACIÓN RELACIONADA A LA RECUPERACIÓN DEL SERVICIO ECOSISTÉMICO DE REGULACIÓN HÍDRICA",null,0,null,"Intangible",null,"TALLER",0]
[null,"INTERCAMBIO DE EXPERIENCIAS RELACIONADA A LA RECUPERACIÓN DEL SERVICIO ECOSISTÉMICO DE REGULACIÓN HÍDRICA",null,0,null,"Intangible",null,"EVENTO",0]
[null,"OTRO:",null,0,null,0,null,0,0]
[null,"CAPACITACIÓN A FUNCIONARIOS PÚBLICOS SOBRE LA GESTIÓN INTEGRADA DEL RECURSO HÍDRICO CON ENFOQUE DE CUENCA",null,0,null,"Intangible",null,{"$f":"N136","v":"TALLER"},{"$f":"L137","v":0}]
[null,"CAPACITACIÓN A FUNCIONARIOS PÚBLICOS SOBRE LAS MEDIDAS DE ADAPTACIÓN EN UN CONTEXTO DE CAMBIO CLIMÁTICO EN LA GESTIÓN INTEGRADA DE LOS RECURSOS HÍDRICOS",null,0,null,"Intangible",null,{"$f":"N137","v":"TALLER"},{"$f":"L138","v":0}]
[null,"DESARROLLO DE CAPACIDADES PARA EL MONITOREO Y SEGUIMIENTO DE LOS ECOSISTEMAS DE INTERÉS HÍDRICO Y EL SERVICIO ECOSISTÉMICO DE REGULACIÓN HÍDRICA",null,0,null,"Intangible",null,"TALLER",{"$f":"L139","v":0}]
[null,"INTERCAMBIO DE EXPERIENCIAS SOBRE LA GESTIÓN INTEGRADA DEL RECURSO HÍDRICO CON ENFOQUE DE CUENCA",null,0,null,"Intangible",null,"EVENTO",{"$f":"L140","v":0}]
[null,"OTRO:",null,0,null,0,null,{"$f":"P141","v":0},{"$f":"N141","v":0}]
[null,"(*) Las acciones asociadas al factor de producción \"Infraestructura Natural\" corresponden a la naturaleza \"Adecuación\", mientras que las acciones asociadas al factor de producción \"Intangible\" corresponden a la naturaleza \"Implementación\". Estas consideraciones han sido desarrolladas en base a la Tabla 2.22 de la \"Guía General para la Identificación, Formulación y Evaluación de Proyectos de Inversión\" del Invierte.pe."]
[null,"Nota: Como parte de las acciones necesarias para lograr las \"Adecuadas capacidades de las entidades a cargo de la gestión del ecosistema\" se tiene que considerar la \"Instalación del sistema de seguimiento y monitoreo del servicio ecosistémico de regulación hídrica\", la cual comprende como mínimo la construcción de un vertedero en la salida de la cuenca y la instalación de un sensor de nivel de agua. Tomar como referencia lo indicado en la pestaña \"Comunicación técnica\"."]

{"sheet":"9.COSTOS ","index":12,"n_rows":149,"n_cols":15,"rows_kept":149,"cut":false,"hidden":false,"merged":[[119,1,120,4],[119,5,119,9],[119,10,120,13],[25,11,25,13],[26,11,26,13],[27,11,27,13],[25,1,25,4],[26,1,26,4],[27,1,27,4],[25,5,25,6],[26,5,26,6],[27,5,27,6],[25,7,25,8],[26,7,26,8],[27,7,27,8],[28,1,28,4],[30,1,30,4],[28,5,28,6],[29,5,29,6],[30,5,30,6],[28,7,28,8],[25,9,25,10],[26,9,26,10],[27,9,27,10],[16,1,16,14],[23,1,23,4],[24,1,24,4],[18,1,18,14],[23,5,23,6],[24,5,24,6],[23,7,23,8],[24,7,24,8],[23,11,23,13],[24,11,24,13],[23,9,23,10],[24,9,24,10],[32,11,32,13],[33,11,33,13],[34,11,34,13],[35,11,35,13],[28,9,28,10],[31,9,31,10],[100,1,102,4],[100,5,100,9],[100,10,102,13],[101,5,101,9],[29,1,29,4],[35,1,35,4],[31,1,31,4],[32,1,32,4],[33,1,33,4],[38,1,38,14],[29,7,29,8],[29,9,29,10],[30,9,30,10],[31,5,31,6],[32,5,32,6],[33,5,33,6],[34,5,34,6],[33,7,33,8],[34,7,34,8],[60,1,60,4],[61,1,61,4],[75,5,75,9],[32,7,32,8],[49,1,49,4],[47,1,47,4],[48,1,48,4],[50,1,50,4],[51,1,51,4],[52,1,52,4],[34,1,34,4],[44,1,46,4],[45,5,45,9],[44,5,44,9],[35,5,35,6],[75,10,76,13],[80,10,80,13],[81,10,81,13],[75,1,76,4],[79,10,79,13],[35,7,35,8],[32,9,32,10],[33,9,33,10],[34,9,34,10],[35,9,35,10],[62,1,62,4],[68,1,69,4],[68,5,68,9],[70,1,70,4],[71,1,71,4],[72,1,72,4],[53,1,53,4],[54,1,54,4],[66,1,66,14],[55,1,57,4],[55,5,55,9],[56,5,56,9],[58,1,58,4],[59,1,59,4],[97,1,97,4],[98,1,98,4],[99,1,99,4],[103,1,103,4],[89,1,91,4],[89,5,89,9],[90,5,90,9],[92,1,92,4],[68,10,69,13],[70,10,70,13],[71,10,71,13],[72,10,72,13],[73,10,73,13],[74,10,74,13],[77,10,77,13],[78,10,78,13],[77,1,77,4],[78,1,78,4],[79,1,79,4],[80,1,80,4],[81,1,81,4],[73,1,73,4],[74,1,74,4],[84,1,84,14],[114,1,114,4],[114,10,114,13],[115,1,115,4],[115,10,115,13],[104,1,104,4],[105,1,105,4],[106,1,106,4],[89,10,91,13],[92,10,92,13],[93,10,93,13],[94,10,94,13],[95,10,95,13],[96,10,96,13],[97,10,97,13],[98,10,98,13],[99,10,99,13],[103,10,103,13],[104,10,104,13],[105,10,105,13],[106,10,106,13],[93,1,93,4],[94,1,94,4],[95,1,95,4],[96,1,96,4],[148,1,148,5],[148,6,148,7],[127,1,127,5],[127,6,127,7],[128,1,128,5],[128,6,128,7],[131,6,131,7],[139,1,140,4],[123,1,123,4],[139,5,139,14],[141,3,141,4],[142,3,142,4],[141,1,142,2],[143,1,144,2],[143,3,143,4],[144,3,144,4],[147,1,147,5],[147,6,147,7],[123,10,123,13],[124,1,124,4],[124,10,124,13],[28,11,28,13],[29,11,29,13],[30,11,30,13],[31,11,31,13],[31,7,31,8],[30,7,30,8],[109,1,109,14],[134,1,134,14],[131,1,131,4],[116,1,116,4],[116,10,116,13],[117,1,117,4],[117,10,117,13],[118,1,118,4],[118,10,118,13],[121,1,121,4],[121,10,121,13],[122,1,122,4],[122,10,122,13],[111,1,112,4],[111,5,111,9],[111,10,112,13],[113,1,113,4],[113,10,113,13]]}
[]
[]
[]
[]
[]
[]
[]
[]
[]
[]
[]
[]
[]
[]
[]
[]
[null,"SECCIÓN N° 9: COSTOS DEL PROYECTO"]
[]
[null,"9.1. Costos de Inversión"]
[]
[null,"Para ingresar el detalle de los costos a nivel de cada actividad, pasar a la hoja de costos, haciendo clic en el siguiente link"]
[]
[]
[null,"Componente",null,null,null,"Tipo de factor productivo",null,"Meta Física",null,"Precio unitario",null,"Costos Sub Total en soles"]
[null,{"$f":"'COSTOS UNITARIOS'!I111","v":"RECUPERACIÓN DE LA COBERTURA VEGETAL NATIVA DEL ECOSISTEMA PRINCIPAL"},null,null,null,{"$f":"'COSTOS UNITARIOS'!P111","v":"Infraestructura natural"},null,{"$f":"'COSTOS UNITARIOS'!S11","v":0},null,{"$f":"'COSTOS UNITARIOS'!U11","v":0},null,{"$f":"'COSTOS UNITARIOS'!R111","v":0}]
[null,{"$f":"'COSTOS UNITARIOS'!I112","v":"RECUPERACIÓN DE LAS CARACTERÍSTICAS DE LA TURBA DEL ECOSISTEMA PRINCIPAL"},null,null,null,{"$f":"'COSTOS UNITARIOS'!P112","v":"Infraestructura natural"},null,{"$f":"'COSTOS UNITARIOS'!S21","v":0},null,{"$f":"'COSTOS UNITARIOS'!U21","v":0},null,{"$f":"'COSTOS UNITARIOS'!R112","v":0}]
[null,{"$f":"'COSTOS UNITARIOS'!I113","v":"RECUPERACIÓN DE LA COBERTURA VEGETAL DE LOS ECOSISTEMAS ASOCIADOS"},null,null,null,{"$f":"'COSTOS UNITARIOS'!P113","v":"Infraestructura natural"},null,{"$f":"'COSTOS UNITARIOS'!S27","v":0},null,{"$f":"'COSTOS UNITARIOS'!U27","v":0},null,{"$f":"'COSTOS UNITARIOS'!R113","v":0}]
[null,{"$f":"'COSTOS UNITARIOS'!I114","v":"RECUPERACIÓN DE LAS CARACTERÍSTICAS DEL SUELO DEL ECOSISTEMA ASOCIADO"},null,null,null,{"$f":"'COSTOS UNITARIOS'!P114","v":"Infraestructura natural"},null,{"$f":"'COSTOS UNITARIOS'!S43","v":0},null,{"$f":"'COSTOS UNITARIOS'!U43","v":0},null,{"$f":"'COSTOS UNITARIOS'!R114","v":0}]
[null,{"$f":"'COSTOS UNITARIOS'!I115","v":"ADAPTACIÓN A LOS REGÍMENES DE PRECIPITACIÓN Y TEMPERATURAS"},null,null,null,{"$f":"'COSTOS UNITARIOS'!P115","v":"Infraestructura natural"},null,{"$f":"'COSTOS UNITARIOS'!S51","v":0},null,{"$f":"'COSTOS UNITARIOS'!U51","v":0},null,{"$f":"'COSTOS UNITARIOS'!R115","v":0}]
[null,{"$f":"'COSTOS UNITARIOS'!I116","v":"ADECUADAS PRÁCTICAS DEL MANEJO DEL ECOSISTEMA"},null,null,null,{"$f":"'COSTOS UNITARIOS'!P116","v":"Intangible"},null,{"$f":"'COSTOS UNITARIOS'!S73","v":0},null,{"$f":"'COSTOS UNITARIOS'!U73","v":0},null,{"$f":"'COSTOS UNITARIOS'!R116","v":0}]
[null,{"$f":"'COSTOS UNITARIOS'!I117","v":"ADECUADAS CAPACIDADES DE LAS ENTIDADES A CARGO DE LA GESTIÓN DEL ECOSISTEMA"},null,null,null,{"$f":"'COSTOS UNITARIOS'!P117","v":"Intangible"},null,{"$f":"'COSTOS UNITARIOS'!S88","v":0},null,{"$f":"'COSTOS UNITARIOS'!U88","v":0},null,{"$f":"'COSTOS UNITARIOS'!R117","v":0}]
[null,"Otros costos",null,null,null,"Tipo de factor productivo",null,"Meta Física",null,"Precio unitario",null,"Costos Sub Total en soles"]
[null,{"$f":"'COSTOS UNITARIOS'!B121","v":"GESTIÓN DEL PROYECTO"},null,null,null,null,null,{"$f":"'COSTOS UNITARIOS'!S103","v":0},null,{"$f":"'COSTOS UNITARIOS'!U103","v":0},null,{"$f":"'COSTOS UNITARIOS'!R121","v":0}]
[null,{"$f":"'COSTOS UNITARIOS'!B122","v":"EXPEDIENTE TÉCNICO"},null,null,null,null,null,{"$f":"'COSTOS UNITARIOS'!S104","v":0},null,{"$f":"'COSTOS UNITARIOS'!U104","v":0},null,{"$f":"'COSTOS UNITARIOS'!R122","v":0}]
[null,{"$f":"'COSTOS UNITARIOS'!B123","v":"SUPERVISIÓN DE EXPEDIENTE TÉCNICO"},null,null,null,null,null,{"$f":"'COSTOS UNITARIOS'!S105","v":0},null,{"$f":"'COSTOS UNITARIOS'!U105","v":0},null,{"$f":"'COSTOS UNITARIOS'!R123","v":0}]
[null,{"$f":"'COSTOS UNITARIOS'!B124","v":"SUPERVISIÓN DE EJECUCIÓN FÍSICA DEL PROYECTO Y LIQUIDACIÓN"},null,null,null,null,null,{"$f":"'COSTOS UNITARIOS'!S106","v":0},null,{"$f":"'COSTOS UNITARIOS'!U106","v":0},null,{"$f":"'COSTOS UNITARIOS'!R124","v":0}]
[null,"Nota: Los referidos ítems son precios finales, por lo que deberían considerar gastos generales, utilidad e IGV, según la modalidad de ejecución."]
[]
[null,"9.2 Cronograma de ejecución financiera"]
[]
[null,"Para poder completar el cronograma, vaya a la hoja cronograma dando clic en el siguiente link "]
[]
[null,"El resumen del cronograma se encuentra únicamente en periodo anual"]
[]
[null,"Componente",null,null,null,"Año"]
[null,null,null,null,null,"Periodo"]
[null,null,null,null,null,1,2,3,4,5]
[null,{"$f":"CRONOGRAMA!B64","v":"RECUPERACIÓN DE LA COBERTURA VEGETAL NATIVA DEL ECOSISTEMA PRINCIPAL"},null,null,null,{"$f":"CRONOGRAMA!G64","v":0},{"$f":"CRONOGRAMA!H64","v":0},{"$f":"CRONOGRAMA!I64","v":0},{"$f":"CRONOGRAMA!J64","v":0},{"$f":"CRONOGRAMA!K64","v":0}]
[null,{"$f":"CRONOGRAMA!B65","v":"RECUPERACIÓN DE LAS CARACTERÍSTICAS DE LA TURBA DEL ECOSISTEMA PRINCIPAL"},null,null,null,{"$f":"CRONOGRAMA!G65","v":0},{"$f":"CRONOGRAMA!H65","v":0},{"$f":"CRONOGRAMA!I65","v":0},{"$f":"CRONOGRAMA!J65","v":0},{"$f":"CRONOGRAMA!K65","v":0}]
[null,{"$f":"CRONOGRAMA!B66","v":"RECUPERACIÓN DE LA COBERTURA VEGETAL DE LOS ECOSISTEMAS ASOCIADOS"},null,null,null,{"$f":"CRONOGRAMA!G66","v":0},{"$f":"CRONOGRAMA!H66","v":0},{"$f":"CRONOGRAMA!I66","v":0},{"$f":"CRONOGRAMA!J66","v":0},{"$f":"CRONOGRAMA!K66","v":0}]
[null,{"$f":"CRONOGRAMA!B67","v":"RECUPERACIÓN DE LAS CARACTERÍSTICAS DEL SUELO DEL ECOSISTEMA ASOCIADO"},null,null,null,{"$f":"CRONOGRAMA!G67","v":0},{"$f":"CRONOGRAMA!H67","v":0},{"$f":"CRONOGRAMA!I67","v":0},{"$f":"CRONOGRAMA!J67","v":0},{"$f":"CRONOGRAMA!K67","v":0}]
[null,{"$f":"CRONOGRAMA!B68","v":"ADAPTACIÓN A LOS REGÍMENES DE PRECIPITACIÓN Y TEMPERATURAS"},null,null,null,{"$f":"CRONOGRAMA!G68","v":0},{"$f":"CRONOGRAMA!H68","v":0},{"$f":"CRONOGRAMA!I68","v":0},{"$f":"CRONOGRAMA!J68","v":0},{"$f":"CRONOGRAMA!K68","v":0}]
[null,{"$f":"CRONOGRAMA!B69","v":"ADECUADAS PRÁCTICAS DEL MANEJO DEL ECOSISTEMA"},null,null,null,{"$f":"CRONOGRAMA!G69","v":0},{"$f":"CRONOGRAMA!H69","v":0},{"$f":"CRONOGRAMA!I69","v":0},{"$f":"CRONOGRAMA!J69","v":0},{"$f":"CRONOGRAMA!K69","v":0}]
[null,{"$f":"CRONOGRAMA!B70","v":"ADECUADAS CAPACIDADES DE LAS ENTIDADES A CARGO DE LA GESTIÓN DEL ECOSISTEMA"},null,null,null,{"$f":"CRONOGRAMA!G70","v":0},{"$f":"CRONOGRAMA!H70","v":0},{"$f":"CRONOGRAMA!I70","v":0},{"$f":"CRONOGRAMA!J70","v":0},{"$f":"CRONOGRAMA!K70","v":0}]
[]
[null,"Otros costos",null,null,null,"Año"]
[null,null,null,null,null,"Periodo"]
[null,null,null,null,null,1,2,3,4,5]
[null,{"$f":"CRONOGRAMA!B74","v":"GESTIÓN DEL PROYECTO"},null,null,null,{"$f":"CRONOGRAMA!G74","v":0},{"$f":"CRONOGRAMA!H74","v":0},{"$f":"CRONOGRAMA!I74","v":0},{"$f":"CRONOGRAMA!J74","v":0},{"$f":"CRONOGRAMA!K74","v":0}]
[null,{"$f":"CRONOGRAMA!B75","v":"EXPEDIENTE TÉCNICO"},null,null,null,{"$f":"CRONOGRAMA!G75","v":0},{"$f":"CRONOGRAMA!H75","v":0},{"$f":"CRONOGRAMA!I75","v":0},{"$f":"CRONOGRAMA!J75","v":0},{"$f":"CRONOGRAMA!K75","v":0}]
[null,{"$f":"CRONOGRAMA!B76","v":"SUPERVISIÓN DE EXPEDIENTE TÉCNICO"},null,null,null,{"$f":"CRONOGRAMA!G76","v":0},{"$f":"CRONOGRAMA!H76","v":0},{"$f":"CRONOGRAMA!I76","v":0},{"$f":"CRONOGRAMA!J76","v":0},{"$f":"CRONOGRAMA!K76","v":0}]
[null,{"$f":"CRONOGRAMA!B77","v":"SUPERVISIÓN DE EJECUCIÓN FÍSICA DEL PROYECTO Y LIQUIDACIÓN"},null,null,null,{"$f":"CRONOGRAMA!G77","v":0},{"$f":"CRONOGRAMA!H77","v":0},{"$f":"CRONOGRAMA!I77","v":0},{"$f":"CRONOGRAMA!J77","v":0},{"$f":"CRONOGRAMA!K77","v":0}]
[null,"Inversión total",null,null,null,{"$f":"CRONOGRAMA!G78","v":0},{"$f":"CRONOGRAMA!H78","v":0},{"$f":"CRONOGRAMA!I78","v":0},{"$f":"CRONOGRAMA!J78","v":0},{"$f":"CRONOGRAMA!K78","v":0}]
[]
[null,"Nota: Para mantener un mejor orden en la presentación e impresión de la presente ficha, las celdas que queden en blanco deben ser ocultadas"]
[]
[null,"9.3 Cronograma de inversión por tipo factor productivo y componente"]
[]
[null,"Factor Productivo/Componente",null,null,null,"Año",null,null,null,null,"Total de inversión por Componente (S/.)"]
[null,null,null,null,null,1,2,3,4,5]
[null,"INFRAESTRUCTURA",null,null,null,{"$f":"SUM(F71)","v":0},{"$f":"SUM(G71)","v":0},0,0,0,{"$f":"SUM(F71:J71)","v":0}]
[null,"EQUIPO",null,null,null,{"$f":"SUM(F72)","v":0},0,0,0,0,{"$f":"SUM(F72:J72)","v":0}]
[null,"INFRAESTRUCTURA NATURAL",null,null,null,{"$f":"+CRONOGRAMA!G64+CRONOGRAMA!G65+CRONOGRAMA!G66+CRONOGRAMA!G67+CRONOGRAMA!G68","v":0},{"$f":"+CRONOGRAMA!H64+CRONOGRAMA!H65+CRONOGRAMA!H66+CRONOGRAMA!H67+CRONOGRAMA!H68","v":0},{"$f":"+CRONOGRAMA!I64+CRONOGRAMA!I65+CRONOGRAMA!I66+CRONOGRAMA!I67+CRONOGRAMA!I68","v":0},{"$f":"+CRONOGRAMA!J64+CRONOGRAMA!J65+CRONOGRAMA!J66+CRONOGRAMA!J67+CRONOGRAMA!J68","v":0},{"$f":"+CRONOGRAMA!K64+CRONOGRAMA!K65+CRONOGRAMA!K66+CRONOGRAMA!K67+CRONOGRAMA!K68","v":0},0]
[null,"INTANGIBLE",null,null,null,{"$f":"CRONOGRAMA!G69+CRONOGRAMA!G70","v":0},{"$f":"CRONOGRAMA!H69+CRONOGRAMA!H70","v":0},{"$f":"CRONOGRAMA!I69+CRONOGRAMA!I70","v":0},{"$f":"CRONOGRAMA!J69+CRONOGRAMA!J70","v":0},{"$f":"CRONOGRAMA!K69+CRONOGRAMA!K70","v":0},0]
[null,"SUB TOTAL POR PERIODO",null,null,null,{"$f":"SUM(F71:F74)","v":0},{"$f":"SUM(G71:G74)","v":0},{"$f":"SUM(H71:H74)","v":0},{"$f":"SUM(I71:I74)","v":0},{"$f":"SUM(J71:J74)","v":0},{"$f":"SUM(F75:J75)","v":0}]
[null,"Otros costos",null,null,null,"Año"]
[null,null,null,null,null,1,2,3,4,5]
[null,{"$f":"CRONOGRAMA!B53","v":"GESTIÓN DEL PROYECTO"},null,null,null,{"$f":"CRONOGRAMA!G74","v":0},{"$f":"CRONOGRAMA!H74","v":0},{"$f":"CRONOGRAMA!I74","v":0},{"$f":"CRONOGRAMA!J74","v":0},{"$f":"CRONOGRAMA!K74","v":0},0]
[null,{"$f":"CRONOGRAMA!B54","v":"EXPEDIENTE TÉCNICO"},null,null,null,{"$f":"CRONOGRAMA!G75","v":0},{"$f":"CRONOGRAMA!H75","v":0},{"$f":"CRONOGRAMA!I75","v":0},{"$f":"CRONOGRAMA!J75","v":0},{"$f":"CRONOGRAMA!K75","v":0},0]
[null,{"$f":"CRONOGRAMA!B55","v":"SUPERVISIÓN DE EXPEDIENTE TÉCNICO"},null,null,null,{"$f":"CRONOGRAMA!G76","v":0},{"$f":"CRONOGRAMA!H76","v":0},{"$f":"CRONOGRAMA!I76","v":0},{"$f":"CRONOGRAMA!J76","v":0},{"$f":"CRONOGRAMA!K76","v":0},0]
[null,{"$f":"CRONOGRAMA!B56","v":"SUPERVISIÓN DE EJECUCIÓN FÍSICA DEL PROYECTO Y LIQUIDACIÓN"},null,null,null,{"$f":"CRONOGRAMA!G77","v":0},{"$f":"CRONOGRAMA!H77","v":0},{"$f":"CRONOGRAMA!I77","v":0},{"$f":"CRONOGRAMA!J77","v":0},{"$f":"CRONOGRAMA!K77","v":0},0]
[null,"COSTO TOTAL DE LA INVERSIÓN",null,null,null,{"$f":"SUM(F78:F81)+F75","v":0},{"$f":"SUM(G78:G81)+G75","v":0},0,0,0,{"$f":"SUM(K78:K81)+K75","v":0}]
[]
[]
[null,"9.4 Cronograma de metas físicas por componente"]
[]
[null,"Para completar el cronograma, ir a la hoja Cronograma dando clic en el siguiente link"]
[]
[]
[null,"Componente",null,null,null,"Año",null,null,null,null,"Meta Total"]
[null,null,null,null,null,"Periodo"]
[null,null,null,null,null,1,2,3,4,5]
[null,{"$f":"CRONOGRAMA!B128","v":"RECUPERACIÓN DE LA COBERTURA VEGETAL NATIVA DEL ECOSISTEMA PRINCIPAL"},null,null,null,{"$f":"CRONOGRAMA!G128","v":0},{"$f":"CRONOGRAMA!H128","v":0},{"$f":"CRONOGRAMA!I128","v":0},{"$f":"CRONOGRAMA!J128","v":0},{"$f":"CRONOGRAMA!K128","v":0},{"$f":"SUM(F93:J93)","v":0}]
[null,{"$f":"CRONOGRAMA!B129","v":"RECUPERACIÓN DE LAS CARACTERÍSTICAS DE LA TURBA DEL ECOSISTEMA PRINCIPAL"},null,null,null,{"$f":"CRONOGRAMA!G129","v":0},{"$f":"CRONOGRAMA!H129","v":0},{"$f":"CRONOGRAMA!I129","v":0},{"$f":"CRONOGRAMA!J129","v":0},{"$f":"CRONOGRAMA!K129","v":0},{"$f":"SUM(F94:J94)","v":0}]
[null,{"$f":"CRONOGRAMA!B130","v":"RECUPERACIÓN DE LA COBERTURA VEGETAL DE LOS ECOSISTEMAS ASOCIADOS"},null,null,null,{"$f":"CRONOGRAMA!G130","v":0},{"$f":"CRONOGRAMA!H130","v":0},{"$f":"CRONOGRAMA!I130","v":0},{"$f":"CRONOGRAMA!J130","v":0},{"$f":"CRONOGRAMA!K130","v":0},0]
[null,{"$f":"CRONOGRAMA!B131","v":"RECUPERACIÓN DE LAS CARACTERÍSTICAS DEL SUELO DEL ECOSISTEMA ASOCIADO"},null,null,null,{"$f":"CRONOGRAMA!G131","v":0},{"$f":"CRONOGRAMA!H131","v":0},{"$f":"CRONOGRAMA!I131","v":0},{"$f":"CRONOGRAMA!J131","v":0},{"$f":"CRONOGRAMA!K131","v":0},0]
[null,{"$f":"CRONOGRAMA!B132","v":"ADAPTACIÓN A LOS REGÍMENES DE PRECIPITACIÓN Y TEMPERATURAS"},null,null,null,{"$f":"CRONOGRAMA!G132","v":0},{"$f":"CRONOGRAMA!H132","v":0},{"$f":"CRONOGRAMA!I132","v":0},{"$f":"CRONOGRAMA!J132","v":0},{"$f":"CRONOGRAMA!K132","v":0},0]
[null,{"$f":"CRONOGRAMA!B133","v":"ADECUADAS PRÁCTICAS DEL MANEJO DEL ECOSISTEMA"},null,null,null,{"$f":"CRONOGRAMA!G133","v":0},{"$f":"CRONOGRAMA!H133","v":0},{"$f":"CRONOGRAMA!I133","v":0},{"$f":"CRONOGRAMA!J133","v":0},{"$f":"CRONOGRAMA!K133","v":0},0]
[null,{"$f":"CRONOGRAMA!B134","v":"ADECUADAS CAPACIDADES DE LAS ENTIDADES A CARGO DE LA GESTIÓN DEL ECOSISTEMA"},null,null,null,{"$f":"CRONOGRAMA!G134","v":0},{"$f":"CRONOGRAMA!H134","v":0},{"$f":"CRONOGRAMA!I134","v":0},{"$f":"CRONOGRAMA!J134","v":0},{"$f":"CRONOGRAMA!K134","v":0},0]
[]
[null,"Otros costos",null,null,null,"Año",null,null,null,null,"Meta Total"]
[null,null,null,null,null,"Periodo"]
[null,null,null,null,null,1,2,3,4,5]
[null,{"$f":"CRONOGRAMA!B138","v":"GESTIÓN DEL PROYECTO"},null,null,null,{"$f":"CRONOGRAMA!G138","v":0},{"$f":"CRONOGRAMA!H138","v":0},{"$f":"CRONOGRAMA!I138","v":0},{"$f":"CRONOGRAMA!J138","v":0},{"$f":"CRONOGRAMA!K138","v":0},0]
[null,{"$f":"CRONOGRAMA!B139","v":"EXPEDIENTE TÉCNICO"},null,null,null,{"$f":"CRONOGRAMA!G139","v":0},{"$f":"CRONOGRAMA!H139","v":0},{"$f":"CRONOGRAMA!I139","v":0},{"$f":"CRONOGRAMA!J139","v":0},{"$f":"CRONOGRAMA!K139","v":0},0]
[null,{"$f":"CRONOGRAMA!B140","v":"SUPERVISIÓN DE EXPEDIENTE TÉCNICO"},null,null,null,{"$f":"CRONOGRAMA!G140","v":0},{"$f":"CRONOGRAMA!H140","v":0},{"$f":"CRONOGRAMA!I140","v":0},{"$f":"CRONOGRAMA!J140","v":0},{"$f":"CRONOGRAMA!K140","v":0},0]
[null,{"$f":"CRONOGRAMA!B141","v":"SUPERVISIÓN DE EJECUCIÓN FÍSICA DEL PROYECTO Y LIQUIDACIÓN"},null,null,null,{"$f":"CRONOGRAMA!G141","v":0},{"$f":"CRONOGRAMA!H141","v":0},{"$f":"CRONOGRAMA!I141","v":0},{"$f":"CRONOGRAMA!J141","v":0},{"$f":"CRONOGRAMA!K141","v":0},0]
[]
[]
[null,"9.5 Cronograma de metas físicas por tipo de factor productivo y componentes"]
[]
[null,"Factor Productivo/Componente",null,null,null,"Año",null,null,null,null,"Meta Total"]
[null,null,null,null,null,1,2,3,4,5]
[null,"INFRAESTRUCTURA",null,null,null,{"$f":"SUM(F114)","v":0},{"$f":"SUM(G114)","v":0},0,0,0,{"$f":"SUM(F114:J114)","v":0}]
[null,"EQUIPO",null,null,null,{"$f":"SUM(F115)","v":0},0,0,0,0,0]
[null,"INFRAESTRUCTURA NATURAL",null,null,null,{"$f":"+CRONOGRAMA!G128+CRONOGRAMA!G129+CRONOGRAMA!G130+CRONOGRAMA!G131+CRONOGRAMA!G132","v":0},{"$f":"+CRONOGRAMA!H128+CRONOGRAMA!H129+CRONOGRAMA!H130+CRONOGRAMA!H131+CRONOGRAMA!H132","v":0},{"$f":"+CRONOGRAMA!I128+CRONOGRAMA!I129+CRONOGRAMA!I130+CRONOGRAMA!I131+CRONOGRAMA!I132","v":0},{"$f":"+CRONOGRAMA!J128+CRONOGRAMA!J129+CRONOGRAMA!J130+CRONOGRAMA!J131+CRONOGRAMA!J132","v":0},{"$f":"+CRONOGRAMA!K128+CRONOGRAMA!K129+CRONOGRAMA!K130+CRONOGRAMA!K131+CRONOGRAMA!K132","v":0},0]
[null,"INTANGIBLE",null,null,null,{"$f":"+CRONOGRAMA!G133+CRONOGRAMA!G134","v":0},{"$f":"+CRONOGRAMA!H133+CRONOGRAMA!H134","v":0},{"$f":"+CRONOGRAMA!I133+CRONOGRAMA!I134","v":0},{"$f":"+CRONOGRAMA!J133+CRONOGRAMA!J134","v":0},{"$f":"+CRONOGRAMA!K133+CRONOGRAMA!K134","v":0},{"$f":"SUM(F117:J117)","v":0}]
[null,"SUB TOTAL POR PERIODO",null,null,null,{"$f":"SUM(F114:F117)","v":0},{"$f":"SUM(G114:G117)","v":0},{"$f":"SUM(H114:H117)","v":0},{"$f":"SUM(I114:I117)","v":0},{"$f":"SUM(J114:J117)","v":0},0]
[]
[null,"Otros costos",null,null,null,"Meses",null,null,null,null,"Meta Total"]
[null,null,null,null,null,1,2,3,4,5]
[null,{"$f":"CRONOGRAMA!B119","v":"GESTIÓN DEL PROYECTO"},null,null,null,{"$f":"CRONOGRAMA!G138","v":0},{"$f":"CRONOGRAMA!H138","v":0},{"$f":"CRONOGRAMA!I138","v":0},{"$f":"CRONOGRAMA!J138","v":0},{"$f":"CRONOGRAMA!K138","v":0},{"$f":"SUM(F122:J122)","v":0}]
[null,{"$f":"CRONOGRAMA!B120","v":"EXPEDIENTE TÉCNICO"},null,null,null,{"$f":"CRONOGRAMA!G139","v":0},{"$f":"CRONOGRAMA!H139","v":0},{"$f":"CRONOGRAMA!I139","v":0},{"$f":"CRONOGRAMA!J139","v":0},{"$f":"CRONOGRAMA!K139","v":0},0]
[null,{"$f":"CRONOGRAMA!B121","v":"SUPERVISIÓN DE EXPEDIENTE TÉCNICO"},null,null,null,{"$f":"CRONOGRAMA!G140","v":0},{"$f":"CRONOGRAMA!H140","v":0},{"$f":"CRONOGRAMA!I140","v":0},{"$f":"CRONOGRAMA!J140","v":0},{"$f":"CRONOGRAMA!K140","v":0},0]
[null,{"$f":"CRONOGRAMA!B122","v":"SUPERVISIÓN DE EJECUCIÓN FÍSICA DEL PROYECTO Y LIQUIDACIÓN"},null,null,null,{"$f":"CRONOGRAMA!G141","v":0},{"$f":"CRONOGRAMA!H141","v":0},{"$f":"CRONOGRAMA!I141","v":0},{"$f":"CRONOGRAMA!J141","v":0},{"$f":"CRONOGRAMA!K141","v":0},{"$f":"SUM(F125:J125)","v":0}]
[]
[]
[null,"Fecha prevista de inicio de ejecución física:  (mes / año): ",null,null,null,null,{"$f":"MIN('8.ANALISIS TÉCNICO'!U106:V127)","v":"00:00:00"}]
[null,"Fecha prevista de término de ejecución física:  (mes / año): ",null,null,null,null,{"$f":"MIN('8.ANALISIS TÉCNICO'!W106:Y127)","v":"00:00:00"}]
[]
[]
[null,"Periodo de ejecución (Días)",null,null,null,null,{"$f":"+'7.HORIZONTE DE EVALUACIÓN'!H38*30","v":0}]
[]
[]
[null,"9.6 Costos de Operación y Mantenimiento con y sin proyecto"]
[]
[null,"Para completar los costos de operación y mantenimiento, ir a la hoja OyM dando clic en el siguiente link"]
[]
[]
[null,"Costo de OyM",null,null,null,"Año (S/.)"]
[null,null,null,null,null,1,2,3,4,5,6,7,8,9,10]
[null,"Sin proyecto",null,"Operación",null,{"$f":"'O&M'!E34","v":0},{"$f":"'O&M'!F34","v":0},{"$f":"'O&M'!G34","v":0},{"$f":"'O&M'!H34","v":0},{"$f":"'O&M'!I34","v":0},{"$f":"'O&M'!J34","v":0},{"$f":"'O&M'!K34","v":0},{"$f":"'O&M'!L34","v":0},{"$f":"'O&M'!M34","v":0},{"$f":"'O&M'!N34","v":0}]
[null,null,null,"Mantenimiento",null,{"$f":"'O&M'!E35","v":0},{"$f":"'O&M'!F35","v":0},{"$f":"'O&M'!G35","v":0},{"$f":"'O&M'!H35","v":0},{"$f":"'O&M'!I35","v":0},{"$f":"'O&M'!J35","v":0},{"$f":"'O&M'!K35","v":0},{"$f":"'O&M'!L35","v":0},{"$f":"'O&M'!M35","v":0},{"$f":"'O&M'!N35","v":0}]
[null,"Con proyecto",null,"Operación",null,{"$f":"'O&M'!E60","v":0},{"$f":"'O&M'!F60","v":0},{"$f":"'O&M'!G60","v":0},{"$f":"'O&M'!H60","v":0},{"$f":"'O&M'!I60","v":0},{"$f":"'O&M'!J60","v":0},{"$f":"'O&M'!K60","v":0},{"$f":"'O&M'!L60","v":0},{"$f":"'O&M'!M60","v":0},{"$f":"'O&M'!N60","v":0}]
[null,null,null,"Mantenimiento",null,{"$f":"'O&M'!E61","v":0},{"$f":"'O&M'!F61","v":0},{"$f":"'O&M'!G61","v":0},{"$f":"'O&M'!H61","v":0},{"$f":"'O&M'!I61","v":0},{"$f":"'O&M'!J61","v":0},{"$f":"'O&M'!K61","v":0},{"$f":"'O&M'!L61","v":0},{"$f":"'O&M'!M61","v":0},{"$f":"'O&M'!N61","v":0}]
[]
[]
[null,"Fecha prevista de inicio de operación:  (mes / año): ",null,null,null,null,{"$f":"+CRONOGRAMA!N122","v":"00:00:00"}]
[null,"Fecha prevista de término de operación:  (mes / año): ",null,null,null,null,{"$f":"G148+365*'7.HORIZONTE DE EVALUACIÓN'!H41","v":"00:00:00"}]

{"sheet":"10.EVALUACION SOCIAL","index":13,"n_rows":29,"n_cols":7,"rows_kept":29,"cut":false,"hidden":false,"merged":[[13,1,13,14],[23,2,23,5],[23,6,23,9],[20,2,20,5],[20,6,20,9],[21,2,21,5],[21,6,21,9],[22,2,22,5],[22,6,22,9],[15,1,15,14],[28,1,28,16],[24,2,24,5],[25,2,25,5],[24,6,24,9],[25,6,25,9],[21,1,25,1]]}
[]
[]
[]
[]
[]
[]
[]
[]
[]
[]
[]
[]
[]
[null,"SECCIÓN N°10: EVALUACIÓN SOCIAL"]
[]
[null,"10.1. Criterios de decisión de Inversión"]
[]
[]
[null,"Método de Evaluación Social"]
[]
[null,"Tipo","Indicador",null,null,null,"Valor"]
[null,"Costo eficacia","Valor Actual de los Costos (VAC)",null,null,null,{"$f":"'FLUJO DE COSTOS'!C66","v":0}]
[null,null,"Costo Eficacia (CE)",null,null,null,{"$f":"'FLUJO DE COSTOS'!C67","v":{"$error":"#DIV/0!"}}]
[null,null,"Costo por Hectárea",null,null,null,{"$f":"'FLUJO DE COSTOS'!C69","v":{"$error":"#DIV/0!"}}]
[null,null,"Costo Eficacia (CE)(**)",null,null,null,{"$f":"'FLUJO DE COSTOS'!C72","v":{"$error":"#DIV/0!"}}]
[null,null,"Costo por M3 (**)",null,null,null,{"$f":"'FLUJO DE COSTOS'!C71","v":{"$error":"#DIV/0!"}}]
[null,"* A precios sociales"]
[]
[null,"** Considerar que este indicador de evaluación social, corresponde a un análisis referencial sobre la recuperación del servicio ecosistémico de regulación hídrica. Para estimar la ganancia hídrica se anexa la pestaña de \"Comunicación técnica\" un metodo que permite generar la información en relación a número de hectáreas recuperadas por volumen de ganancia hídrica. El cálculo del indicador no es obligatorio."]

{"sheet":"11.SOSTENIBILIDAD","index":14,"n_rows":51,"n_cols":20,"rows_kept":51,"cut":false,"hidden":false,"merged":[[15,1,15,14],[24,1,24,3],[24,4,24,7],[17,1,17,14],[22,1,22,14],[20,1,20,10],[21,1,21,10],[24,8,24,11],[25,1,25,3],[25,4,25,7],[26,1,26,3],[26,4,26,7],[25,8,25,11],[26,8,26,11],[33,1,33,3],[33,4,33,7],[33,9,33,10],[34,1,34,3],[34,4,34,7],[34,9,34,10],[35,4,35,7],[35,9,35,10],[36,1,36,3],[36,4,36,7],[36,9,36,10],[43,19,43,20],[44,1,44,4],[44,5,44,10],[44,11,44,12],[44,13,44,14],[44,15,44,18],[44,19,44,20],[43,1,43,4],[43,5,43,10],[43,11,43,12],[43,13,43,14],[43,15,43,18],[50,1,50,28],[47,19,47,20],[48,1,48,4],[48,5,48,10],[48,11,48,12],[48,13,48,14],[48,15,48,18],[48,19,48,20],[47,1,47,4],[47,5,47,10],[47,11,47,12],[47,13,47,14],[47,15,47,18],[49,1,49,18],[49,19,49,20],[45,19,45,20],[46,1,46,4],[46,5,46,10],[46,11,46,12],[46,13,46,14],[46,15,46,18],[46,19,46,20],[45,13,45,14],[45,15,45,18],[29,1,29,14],[31,1,31,14],[41,1,41,14],[45,1,45,4],[45,5,45,10],[45,11,45,12],[39,1,39,3],[39,4,39,7],[39,9,39,10],[37,1,37,3],[37,4,37,7],[37,9,37,10],[38,1,38,3],[38,4,38,7],[38,9,38,10],[35,1,35,3]]}
[]
[]
[]
[]
[]
[]
[]
[]
[]
[]
[]
[]
[]
[]
[]
[null,"SECCIÓN N°11: SOSTENIBILIDAD"]
[]
[null,"11.1. Descripción de la capacidad institucional en la sostenibilidad del proyecto"]
[]
[]
[null,"11.1.1. ¿ES LA UNIDAD EJECUTORA DE INVERSIONES LA RESPONSABLE DE LA OPERACIÓN Y MANTENIMIENTO DEL PROYECTO DE INVERSIÓN CON CARGO A SU PRESUPUESTO INSTITUCIONAL?",null,null,null,null,null,null,null,null,null,null,"si",null,"no",null,null,null,"SI"]
[null,null,null,null,null,null,null,null,null,null,null,null,null,null,null,null,null,null,"NO"]
[null,"11.1.2. DOCUMENTOS QUE SUSTENTAN LOS ACUERDOS INSTITUCIONALES U OTROS QUE GARANTIZAN EL FINANCIAMIENTO DE LOS GASTOS DE OPERACIÓN Y MANTENIMIENTO"]
[]
[null,"DOCUMENTO",null,null,"ENTIDAD / ORGANIZACIÓN",null,null,null,"COMPROMISO"]
[]
[]
[]
[]
[null,"11.2. Capacidad de Gestión del Operador"]
[]
[null,"11.2.1. CAPACIDAD DE GESTIÓN DEL OPERADOR"]
[]
[null,"Incluye organigrama del funcionamiento",null,null,"Puestos",null,null,null,"Honorarios por puesto","Perfil del Puesto",null,"Roles del puesto"]
[]
[]
[]
[]
[]
[]
[]
[null,"11.2.2. GESTIÓN INTEGRAL DE RIESGOS"]
[]
[null,"TIPO DE PELIGRO",null,null,null,"DESCRIPCIÓN DEL PELIGRO",null,null,null,null,null,"PROBABILIDAD DE OCURRENCIA",null,"IMPACTO",null,"MEDIDAS DE MITIGACIÓN (RESILENCIA)",null,null,null,"COSTO (S/)"]
[null,null,null,null,null,null,null,null,null,null,null,"Mayor",null,"Medio"]
[]
[]
[]
[]
[null,"TOTAL",null,null,null,null,null,null,null,null,null,null,null,null,null,null,null,null,null,{"$f":"SUM(T45:U49)","v":0}]
[null,"NOTA: LOS COSTOS ASOCIADOS A LA GESTIÓN DE RIESGOS DEBERÁN SER INCORPORADOS A CADA UNA DE LAS ACCIONES QUE LO GENEREN"]

{"sheet":"12.GESTIÓN","index":15,"n_rows":54,"n_cols":8,"rows_kept":54,"cut":false,"hidden":false,"merged":[[17,1,17,14],[28,1,28,5],[42,1,42,5],[44,1,44,8],[37,1,37,5],[38,1,38,5],[39,1,39,5],[40,1,40,5],[41,1,41,5],[23,1,23,5],[24,1,24,5],[25,1,25,5],[26,1,26,5],[27,1,27,5],[19,1,19,14],[31,1,31,14],[48,7,48,8],[49,1,51,1],[49,7,49,8],[50,7,50,8],[51,7,51,8],[48,5,48,6],[50,5,50,6],[51,5,51,6],[35,1,35,14],[46,1,46,14],[33,1,33,14],[48,1,48,4],[53,1,53,2],[52,7,52,8],[53,5,53,6],[53,7,53,8],[53,3,53,4],[49,5,49,6],[52,5,52,6],[52,1,52,2],[49,3,49,4],[50,3,50,4],[51,3,51,4],[52,3,52,4]]}
[]
[]
[]
[]
[]
[]
[]
[]
[]
[]
[]
[]
[]
[]
[]
[]
[]
[null,"SECCIÓN N°12: GESTIÓN DEL PROYECTO"]
[]
[null,"12.1. Modalidad de ejecución del proyecto"]
[]
[null,"Se deberá marcar la modalidad de ejecución del proyecto ya que, dependiendo de esta, las capacidades pueden ser distintas"]
[]
[null,"Tipo de ejecución",null,null,null,null,"Marcar"]
[null,"Administración directa"]
[null,"Administración indirecta – por contrata"]
[null,"Administración indirecta – Asociación Público Privado (APP)"]
[null,"Administración indirecta – Núcleo Ejecutor"]
[null,"Administración indirecta – Ley 29230 (Obras por Impuestos)"]
[]
[]
[null,"12.2. Entidad u órgano que estará a cargo de la operación y mantenimiento"]
[]
[]
[]
[null,"12.3. Fuente de financiamiento"]
[]
[null,"Fuente de Financiamiento","Marcar",null,null,null,"Marcar"]
[null,"Recursos ordinarios"]
[null,"Recursos directamente recaudados"]
[null,"Recursos por operaciones oficiales de crédito"]
[null,"Donaciones y transferencias"]
[null,"Recursos determinados"]
[]
[null,"En caso se seleccione como fuente de financiamiento ROOC, se deberá sustentar la estructuración financiera del monto de inversión del Proyecto."]
[]
[null,"12.4. Requerimientos institucionales y/o normativos"]
[]
[null,"REQUERIMIENTOS INSTITUCIONALES Y NORMATIVOS",null,null,null,"FASE FORMULACIÓN",null,"FASE DE EJECUCIÓN"]
[null,"SANEAMIENTO FÍSICO LEGAL","TERRENO DE PRIVADO O DE PROPIEDAD DE COMUNIDAD CAMPESINA",true,null,{"$f":"+IF(D50=FALSE,\"\",\"CARGO DE INICIO DE TRÁMITE DE INSCRIPCIÓN ANTE SUNARP (COMPRA-VENTA, CESIÓN EN USO, DONACIÓN, TRANSFERENCIA U OTRO MECANISMO LEGAL)\")","v":"CARGO DE INICIO DE TRÁMITE DE INSCRIPCIÓN ANTE SUNARP (COMPRA-VENTA, CESIÓN EN USO, DONACIÓN, TRANSFERENCIA U OTRO MECANISMO LEGAL)"},null,{"$f":"+IF(D50=FALSE,\"\",\"TERRENO REGISTRADO EN SUNARP A FAVOR DE LA ENTIDAD COMPETENTE (GOBIERNO LOCAL, GOBIERNO REGIONAL, GOBIERNO NACIONAL)\")","v":"TERRENO REGISTRADO EN SUNARP A FAVOR DE LA ENTIDAD COMPETENTE (GOBIERNO LOCAL, GOBIERNO REGIONAL, GOBIERNO NACIONAL)"}]
[null,null,"TERRENO DE ENTIDAD PÚBLICA (SBN, MINISTERIO, ETC)",true,null,{"$f":"+IF(D51=FALSE,\"\",\"PARTIDA REGISTRAL ACTUALIZADA Y SOLICITUD DE TRANSFERENCIA DEL TERRENO A FAVOR DE LA ENTIDAD PÚBLICA QUE SE HARA CARGO DE LA OPERACIÓN Y MANTENIMIENTO DEL PROYECTO\")","v":"PARTIDA REGISTRAL ACTUALIZADA Y SOLICITUD DE TRANSFERENCIA DEL TERRENO A FAVOR DE LA ENTIDAD PÚBLICA QUE SE HARA CARGO DE LA OPERACIÓN Y MANTENIMIENTO DEL PROYECTO"},null,{"$f":"+IF(D51=FALSE,\"\",\"PARTIDA REGISTRAL ACTUALIZADA (INCLUYE TRANSFERENCIA)\")","v":"PARTIDA REGISTRAL ACTUALIZADA (INCLUYE TRANSFERENCIA)"}]
[null,null,"TERRENO DE PROPIEDAD DE LA MUNICIPALIDAD Y/O GOBIERNO REGIONAL",true,null,{"$f":"+IF(D52=FALSE,\"\",\"PARTIDA REGISTRAL ACTUALIZADA\")","v":"PARTIDA REGISTRAL ACTUALIZADA"},null,{"$f":"+IF(D52=FALSE,\"\",\"PARTIDA REGISTRAL ACTUALIZADA\")","v":"PARTIDA REGISTRAL ACTUALIZADA"}]
[null,"CONVENIO INTERINSTITUCIONAL ENTRE LOS DISTINTOS NIVELES DE GOBIERNO (GOBIERNO NACIONAL, GOBIERNO REGIONAL, GOBIERNO LOCAL)",null,true,null,{"$f":"+IF(D53=FALSE,\"\",\"CONVENIO DE FORMULACIÓN SUSCRITO ENTRE LOS DISTINTOS NIVELES DE GOBIERNO\")","v":"CONVENIO DE FORMULACIÓN SUSCRITO ENTRE LOS DISTINTOS NIVELES DE GOBIERNO"},null,{"$f":"+IF(D53=FALSE,\"\",\"CONVENIO DE EJECUCIÓN SUSCRITO ENTRE LOS DISTINTOS NIVELES DE GOBIERNO\")","v":"CONVENIO DE EJECUCIÓN SUSCRITO ENTRE LOS DISTINTOS NIVELES DE GOBIERNO"}]
[null,"OTRO (ESPECIFICAR):",null,false]

{"sheet":"13.IMPACTO AMBIENTAL","index":16,"n_rows":28,"n_cols":9,"rows_kept":28,"cut":false,"hidden":false,"merged":[[15,1,15,14],[19,1,19,4],[19,5,19,7],[20,1,20,4],[20,5,20,7],[17,1,17,14],[21,1,21,4],[21,5,21,7],[38,1,38,12],[39,1,39,12],[32,1,32,4],[22,1,22,4],[22,5,22,7],[24,1,24,4],[24,5,24,7],[25,1,25,4],[25,5,25,7],[26,1,26,4],[26,5,26,7],[27,1,27,4],[27,5,27,7],[31,1,31,4],[29,1,29,14],[34,1,34,14],[36,1,36,12],[23,1,23,4],[23,5,23,7]]}
[]
[]
[]
[]
[]
[]
[]
[]
[]
[]
[]
[]
[]
[]
[]
[null,"SECCIÓN N°13: IMPACTO AMBIENTAL"]
[]
[null,"13.1. Impacto ambiental"]
[]
[null,"IMPACTOS NEGATIVOS",null,null,null,"MEDIDAS DE MITIGACIÓN",null,null,"COSTO (S/)"]
[null,"Durante la Ejecución"]
[null,"Impacto 1:"]
[null,"Impacto 2:"]
[null,"…"]
[null,"Durante el Funcionamiento"]
[null,"Impacto 1:"]
[null,"Impacto 2:"]
[null,"…"]

{"sheet":"14.MATRIZ MARCO LOGICO","index":17,"n_rows":74,"n_cols":24,"rows_kept":74,"cut":false,"hidden":false,"merged":[[71,1,71,13],[74,1,74,8],[73,1,73,11],[16,1,16,14],[20,14,20,16],[21,14,21,16],[23,14,23,16],[20,11,20,13],[21,11,21,13],[23,11,23,13],[20,1,20,3],[21,1,21,3],[23,1,29,3],[28,14,28,16],[29,14,29,16],[29,4,29,6],[20,7,20,10],[21,8,21,10],[23,8,23,10],[28,8,28,10],[29,8,29,10],[24,4,24,6],[25,4,25,6],[20,4,20,6],[21,4,21,6],[25,14,25,16],[23,4,23,6],[63,11,63,13],[31,4,31,6],[32,4,32,6],[33,4,33,6],[35,4,35,6],[59,8,59,10],[28,4,28,6],[26,4,26,6],[27,4,27,6],[24,11,24,13],[25,11,25,13],[26,11,26,13],[27,11,27,13],[28,11,28,13],[39,14,39,16],[36,14,36,16],[40,14,40,16],[41,14,41,16],[56,11,56,13],[51,11,51,13],[52,11,52,13],[67,4,67,6],[66,11,66,13],[67,11,67,13],[38,4,38,6],[39,4,39,6],[36,4,36,6],[46,4,46,6],[50,4,50,6],[47,4,47,6],[48,4,48,6],[49,4,49,6],[41,8,41,10],[60,8,60,10],[41,11,41,13],[42,11,42,13],[66,4,66,6],[62,8,62,10],[63,8,63,10],[57,8,57,10],[68,14,68,16],[57,14,57,16],[58,14,58,16],[59,14,59,16],[60,14,60,16],[68,4,68,6],[64,4,64,6],[65,4,65,6],[29,11,29,13],[62,4,62,6],[59,4,59,6],[40,4,40,6],[41,4,41,6],[44,4,44,6],[64,7,64,10],[65,7,65,10],[66,7,66,10],[56,4,56,6],[57,4,57,6],[61,4,61,6],[52,4,52,6],[53,4,53,6],[54,4,54,6],[55,4,55,6],[30,11,30,13],[37,11,37,13],[38,11,38,13],[39,11,39,13],[40,11,40,13],[43,4,43,6],[43,8,43,10],[63,4,63,6],[34,11,34,13],[35,11,35,13],[36,11,36,13],[60,4,60,6],[31,11,31,13],[32,11,32,13],[33,11,33,13],[43,11,43,13],[68,11,68,13],[36,8,36,10],[32,8,32,10],[33,8,33,10],[35,8,35,10],[67,7,67,10],[68,7,68,10],[44,11,44,13],[45,11,45,13],[38,14,38,16],[30,14,30,16],[43,14,43,16],[22,1,22,3],[22,4,22,6],[22,8,22,10],[24,8,24,10],[25,8,25,10],[26,8,26,10],[27,8,27,10],[31,8,31,10],[24,14,24,16],[26,14,26,16],[27,14,27,16],[31,14,31,16],[32,14,32,16],[33,14,33,16],[30,1,68,3],[61,8,61,10],[48,11,48,13],[49,11,49,13],[50,11,50,13],[47,11,47,13],[56,14,56,16],[52,14,52,16],[53,14,53,16],[54,14,54,16],[55,14,55,16],[46,14,46,16],[47,14,47,16],[55,8,55,10],[56,8,56,10],[53,11,53,13],[54,11,54,13],[55,11,55,13],[51,14,51,16],[63,14,63,16],[64,14,64,16],[65,14,65,16],[66,14,66,16],[67,14,67,16],[22,11,22,13],[64,11,64,13],[65,11,65,13],[62,14,62,16],[61,11,61,13],[62,11,62,13],[46,11,46,13],[57,11,57,13],[58,11,58,13],[59,11,59,13],[60,11,60,13],[61,14,61,16],[48,14,48,16],[49,14,49,16],[50,14,50,16],[42,14,42,16],[44,14,44,16],[34,14,34,16],[35,14,35,16],[70,1,70,16],[18,1,18,14],[30,4,30,10],[34,4,34,10],[37,4,37,10],[42,4,42,10],[45,4,45,10],[51,4,51,10],[58,4,58,10],[22,14,22,16],[44,8,44,10],[38,8,38,10],[39,8,39,10],[40,8,40,10],[48,8,48,10],[49,8,49,10],[46,8,46,10],[47,8,47,10],[50,8,50,10],[52,8,52,10],[53,8,53,10],[54,8,54,10],[45,14,45,16],[37,14,37,16]]}
[]
[]
[]
[]
[]
[]
[]
[]
[]
[]
[]
[]
[]
[]
[]
[]
[null,"SECCIÓN N°14: MARCO LÓGICO"]
[]
[null,"14.1. RESUMEN DEL PROYECTO: MATRIZ DEL MARCO LÓGICO"]
[]
[null,"Nivel de objetivo",null,null,"Descripción",null,null,"Indicadores",null,null,null,"Medios de verificación",null,null,"Supuestos"]
[null,"Fin",null,null,"AUMENTO DEL APROVECHAMIENTO SOSTENIBLE DEL CAPITAL NATURAL",null,null,{"$f":"'4.UNIDAD PRODUCTORA'!O58","v":0},{"$f":"IF(E22=\"\",\"\",\"HECTÁREAS DE ECOSISTEMAS APROVECHADOS DE MANERA SOSTENIBLE\")","v":"HECTÁREAS DE ECOSISTEMAS APROVECHADOS DE MANERA SOSTENIBLE"},null,null,"DIAGNÓSTICO DE LOS PLANES DE DESARROLLO. REPORTES DEL AREA ENCARGADA DE LA RECUPERACIÓN DEL AREA DEGRADADA, ENTRE OTROS"]
[null,"Propósito",null,null,{"$f":"'6.PROBLEMA-OBJETIVO'!B69","v":"RECUPERACIÓN DEL SERVICIO ECOSISTÉMICO DE REGULACIÓN HÍDRICA DE LA MICROCUENCA DE 0"},null,null,{"$f":"+'FLUJO DE COSTOS'!C70","v":0},{"$f":"IF(E23=\"\",\"\",\"INCREMENTO DEL CAUDAL EN ÉPOCA DE ESTIAJE\")&\"*\"","v":"INCREMENTO DEL CAUDAL EN ÉPOCA DE ESTIAJE*"},null,null,"INFORME DEL ÁREA RESPONSABLE DE LA RECUPERACIÓN DEL ÁREA DEGRADADA",null,null,"EL ÁREA ENCARGADA CUMPLE CON LAS ACCIONES DE MONITOREO Y CONTROL PARA LA RECUPERACIÓN DEL ÁREA DEGRADADA"]
[null,"Componentes/\nProductos",null,null,{"$f":"'6.PROBLEMA-OBJETIVO'!C102","v":"RECUPERACIÓN DE LA COBERTURA VEGETAL NATIVA DEL ECOSISTEMA PRINCIPAL"},null,null,{"$f":"'9.COSTOS '!K93","v":0},{"$f":"IF(E24=\"\",\"\",CONCATENATE('8.ANALISIS TÉCNICO'!E106))","v":"HECTÁREAS DE COBERTURA VEGETAL INCREMENTADAS DEL ECOSISTEMA PRINCIPAL"},null,null,"OTRO",null,null,null,null,null,null,null,null,null,null,null,"LA POBLACIÓN BENEFICIARIA SENSIBILIZADA QUE RECIBIÓ CAPACITACIÓN Y ASISTENCIA TÉCNICA INTERNALIZA Y APLICA CONOCIMIENTOS Y EXPERIENCIAS ADQUIRIDAS"]
[null,null,null,null,{"$f":"'6.PROBLEMA-OBJETIVO'!C105","v":"RECUPERACIÓN DE LAS CARACTERÍSTICAS DE LA TURBA DEL ECOSISTEMA PRINCIPAL"},null,null,{"$f":"'9.COSTOS '!F94","v":0},{"$f":"IF(E25=\"\",\"\",CONCATENATE('8.ANALISIS TÉCNICO'!E110))","v":"HECTÁREAS DE LA ESTRUCTURA DE LA TURBA RECUPERADA DEL ECOSISTEMA PRINCIPAL"},null,null,"INFORMES DE EJECUCIÓN DE LOS TALLERES DE CAPACITACIÓN AL PERSONAL MUNICIPAL ENCARGADO DE LA RECUPERACIÓN",null,null,null,null,null,null,null,null,null,null,null,"LAS ENTIDADES QUE RECIBIERON CAPACITACIÓN Y ASISTENCIA TÉCNICA INTERNALIZAN Y APLICAN CONOCIMIENTOS Y EXPERIENCIAS ADQUIRIDAS"]
[null,null,null,null,{"$f":"'6.PROBLEMA-OBJETIVO'!C107","v":"RECUPERACIÓN DE LA COBERTURA VEGETAL DE LOS ECOSISTEMAS ASOCIADOS"},null,null,{"$f":"'9.COSTOS '!F95","v":0},{"$f":"IF(E26=\"\",\"\",CONCATENATE('8.ANALISIS TÉCNICO'!E113))","v":"HECTÁREAS DE COBERTURA VEGETAL INCREMENTADAS DE LOS ECOSISTEMAS ASOCIADOS"}]
[null,null,null,null,{"$f":"'6.PROBLEMA-OBJETIVO'!C111","v":"RECUPERACIÓN DE LAS CARACTERÍSTICAS DEL SUELO DEL ECOSISTEMA ASOCIADO"},null,null,{"$f":"'9.COSTOS '!F96","v":0},{"$f":"IF(E27=\"\",\"\",CONCATENATE('8.ANALISIS TÉCNICO'!E118))","v":"HECTÁREAS DE LA ESTRUCTURA DEL SUELO RECUPERADA DE LOS ECOSISTEMAS ASOCIADOS"}]
[null,null,null,null,{"$f":"'6.PROBLEMA-OBJETIVO'!C113","v":"ADAPTACIÓN A LOS REGÍMENES DE PRECIPITACIÓN Y TEMPERATURAS"},null,null,{"$f":"'9.COSTOS '!F97","v":0},{"$f":"IF(E28=\"\",\"\",CONCATENATE('8.ANALISIS TÉCNICO'!E121))","v":"NÚMERO DE MEDIDAS DE ADAPTACIÓN AL RÉGIMEN DE PRECIPITACIONES Y TEMPERATURAS"}]
[null,null,null,null,{"$f":"'6.PROBLEMA-OBJETIVO'!C119","v":"ADECUADAS PRÁCTICAS DEL MANEJO DEL ECOSISTEMA"},null,null,{"$f":"'9.COSTOS '!F98","v":0},{"$f":"IF(E29=\"\",\"\",CONCATENATE('8.ANALISIS TÉCNICO'!E128))","v":"POBLADORES CON ADECUADAS CAPACIDADES EN PRÁCTICAS DE MANEJO DE LOS ECOSISTEMAS DE INTERÉS HÍDRICO"}]
[null,null,null,null,{"$f":"'6.PROBLEMA-OBJETIVO'!C125","v":"ADECUADAS CAPACIDADES DE LAS ENTIDADES A CARGO DE LA GESTIÓN DEL ECOSISTEMA"},null,null,{"$f":"'9.COSTOS '!F99","v":0},{"$f":"IF(E30=\"\",\"\",CONCATENATE('8.ANALISIS TÉCNICO'!E135))","v":"N° DE ÁREAS U ÓRGANOS ENCARGADOS DE LA GESTIÓN DEL ECOSISTEMA DE INTERÉS HÍDRICO CON ADECUADAS CAPACIDADES EN GESTIÓN DEL ECOSISTEMA"}]
[null,"Acciones",null,null,{"$f":"'6.PROBLEMA-OBJETIVO'!C102","v":"RECUPERACIÓN DE LA COBERTURA VEGETAL NATIVA DEL ECOSISTEMA PRINCIPAL"}]
[null,null,null,null,{"$f":"'8.ANALISIS TÉCNICO'!G107","v":"REVEGETACIÓN CON ESPECIES NATIVAS"},null,null,{"$f":"'8.ANALISIS TÉCNICO'!L107","v":0},{"$f":"IF(E32=\"\",\"\",CONCATENATE('COSTOS UNITARIOS'!R12,\" DE \",'8.ANALISIS TÉCNICO'!G107,\" A UN COSTO DE S/. \",'COSTOS UNITARIOS'!W12))","v":"HA DE REVEGETACIÓN CON ESPECIES NATIVAS A UN COSTO DE S/. 0"},null,null,null,null,null,null,null,null,null,null,null,null,null,null,"LA OCURRENCIA DE LAS LLUVIAS NO SE EXTIENDE MÁS ALLÁ DE SU PERIODO NORMAL"]
[null,null,null,null,{"$f":"'8.ANALISIS TÉCNICO'!G108","v":"INSTALACIÓN DE CERCOS EXCLUIDORES"},null,null,{"$f":"'8.ANALISIS TÉCNICO'!L108","v":0},{"$f":"IF(E33=\"\",\"\",CONCATENATE('COSTOS UNITARIOS'!R15,\" DE \",'8.ANALISIS TÉCNICO'!G108,\" A UN COSTO DE S/. \",'COSTOS UNITARIOS'!W15))","v":"ML DE INSTALACIÓN DE CERCOS EXCLUIDORES A UN COSTO DE S/. 0"},null,null,null,null,null,null,null,null,null,null,null,null,null,null,"LOS RECURSOS PARA LA EJECUCIÓN NO SON MODIFICADOS PARA OTRAS PRIORIDADES"]
[null,null,null,null,{"$f":"'8.ANALISIS TÉCNICO'!G109","v":"OTRO:"},null,null,{"$f":"'8.ANALISIS TÉCNICO'!L109","v":0},{"$f":"IF(E34=\"\",\"\",CONCATENATE('COSTOS UNITARIOS'!R19,\" DE \",'8.ANALISIS TÉCNICO'!G109,\" A UN COSTO DE S/. \",'COSTOS UNITARIOS'!W19))","v":" DE OTRO: A UN COSTO DE S/. 0"}]
[null,null,null,null,{"$f":"'6.PROBLEMA-OBJETIVO'!C105","v":"RECUPERACIÓN DE LAS CARACTERÍSTICAS DE LA TURBA DEL ECOSISTEMA PRINCIPAL"}]
[null,null,null,null,{"$f":"'8.ANALISIS TÉCNICO'!G111","v":"REVEGETACIÓN CON ESPECIES NATIVAS"},null,null,{"$f":"'8.ANALISIS TÉCNICO'!L111","v":0},{"$f":"IF(E36=\"\",\"\",CONCATENATE('COSTOS UNITARIOS'!R22,\" DE \",'8.ANALISIS TÉCNICO'!G111,\" A UN COSTO DE S/. \",'COSTOS UNITARIOS'!W22))","v":"HA DE REVEGETACIÓN CON ESPECIES NATIVAS A UN COSTO DE S/. 0"}]
[null,null,null,null,{"$f":"'8.ANALISIS TÉCNICO'!G112","v":"OTRO:"},null,null,{"$f":"'8.ANALISIS TÉCNICO'!L112","v":0},{"$f":"IF(E37=\"\",\"\",CONCATENATE('COSTOS UNITARIOS'!R25,\" DE \",'8.ANALISIS TÉCNICO'!G112,\" A UN COSTO DE S/. \",'COSTOS UNITARIOS'!W25))","v":" DE OTRO: A UN COSTO DE S/. 0"}]
[null,null,null,null,{"$f":"'6.PROBLEMA-OBJETIVO'!C107","v":"RECUPERACIÓN DE LA COBERTURA VEGETAL DE LOS ECOSISTEMAS ASOCIADOS"}]
[null,null,null,null,{"$f":"'8.ANALISIS TÉCNICO'!G114","v":"REFORESTACIÓN CON ESPECIES NATIVAS"},null,null,{"$f":"'8.ANALISIS TÉCNICO'!L114","v":0},{"$f":"IF(E39=\"\",\"\",CONCATENATE('COSTOS UNITARIOS'!R28,\" DE \",'8.ANALISIS TÉCNICO'!G114,\" A UN COSTO DE S/. \",'COSTOS UNITARIOS'!W28))","v":"HA DE REFORESTACIÓN CON ESPECIES NATIVAS A UN COSTO DE S/. 0"}]
[null,null,null,null,{"$f":"'8.ANALISIS TÉCNICO'!G115","v":"REVEGETACIÓN CON ESPECIES NATIVAS"},null,null,{"$f":"'8.ANALISIS TÉCNICO'!L115","v":0},{"$f":"IF(E40=\"\",\"\",CONCATENATE('COSTOS UNITARIOS'!R34,\" DE \",'8.ANALISIS TÉCNICO'!G115,\" A UN COSTO DE S/. \",'COSTOS UNITARIOS'!W34))","v":"HA DE REVEGETACIÓN CON ESPECIES NATIVAS A UN COSTO DE S/. 0"}]
[null,null,null,null,{"$f":"'8.ANALISIS TÉCNICO'!G116","v":"INSTALACIÓN DE CERCOS EXCLUIDORES"},null,null,{"$f":"'8.ANALISIS TÉCNICO'!L116","v":0},{"$f":"IF(E41=\"\",\"\",CONCATENATE('COSTOS UNITARIOS'!R37,\" DE \",'8.ANALISIS TÉCNICO'!G116,\" A UN COSTO DE S/. \",'COSTOS UNITARIOS'!W37))","v":"ML DE INSTALACIÓN DE CERCOS EXCLUIDORES A UN COSTO DE S/. 0"}]
[null,null,null,null,{"$f":"'8.ANALISIS TÉCNICO'!G117","v":"OTRO:"},null,null,{"$f":"'8.ANALISIS TÉCNICO'!L117","v":0},{"$f":"IF(E42=\"\",\"\",CONCATENATE('COSTOS UNITARIOS'!R41,\" DE \",'8.ANALISIS TÉCNICO'!G117,\" A UN COSTO DE S/. \",'COSTOS UNITARIOS'!W41))","v":" DE OTRO: A UN COSTO DE S/. 0"}]
[null,null,null,null,{"$f":"'6.PROBLEMA-OBJETIVO'!C111","v":"RECUPERACIÓN DE LAS CARACTERÍSTICAS DEL SUELO DEL ECOSISTEMA ASOCIADO"}]
[null,null,null,null,{"$f":"'8.ANALISIS TÉCNICO'!G119","v":"ENRIQUECIMIENTO DE SUELOS"},null,null,{"$f":"'8.ANALISIS TÉCNICO'!L119","v":0},{"$f":"IF(E44=\"\",\"\",CONCATENATE('COSTOS UNITARIOS'!R44,\" DE \",'8.ANALISIS TÉCNICO'!G119,\" A UN COSTO DE S/. \",'COSTOS UNITARIOS'!W44))","v":"HA DE ENRIQUECIMIENTO DE SUELOS A UN COSTO DE S/. 0"}]
[null,null,null,null,{"$f":"'8.ANALISIS TÉCNICO'!G120","v":"OTRO:"},null,null,{"$f":"'8.ANALISIS TÉCNICO'!L120","v":0},{"$f":"IF(E45=\"\",\"\",CONCATENATE('COSTOS UNITARIOS'!R49,\" DE \",'8.ANALISIS TÉCNICO'!G120,\" A UN COSTO DE S/. \",'COSTOS UNITARIOS'!W49))","v":" DE OTRO: A UN COSTO DE S/. 0"}]
[null,null,null,null,{"$f":"'6.PROBLEMA-OBJETIVO'!C113","v":"ADAPTACIÓN A LOS REGÍMENES DE PRECIPITACIÓN Y TEMPERATURAS"}]
[null,null,null,null,{"$f":"'8.ANALISIS TÉCNICO'!G122","v":"REPARACIÓN DEL CANAL AMUNADOR"},null,null,{"$f":"'8.ANALISIS TÉCNICO'!L122","v":0},{"$f":"IF(E47=\"\",\"\",CONCATENATE('COSTOS UNITARIOS'!R52,\" DE \",'8.ANALISIS TÉCNICO'!G122,\" A UN COSTO DE S/. \",'COSTOS UNITARIOS'!W52))","v":"HA DE REPARACIÓN DEL CANAL AMUNADOR A UN COSTO DE S/. 0"}]
[null,null,null,null,{"$f":"'8.ANALISIS TÉCNICO'!G123","v":"REPARACIÓN DEL CANAL DE MAMANTEO"},null,null,{"$f":"'8.ANALISIS TÉCNICO'!L123","v":0},{"$f":"IF(E48=\"\",\"\",CONCATENATE('COSTOS UNITARIOS'!R56,\" DE \",'8.ANALISIS TÉCNICO'!G123,\" A UN COSTO DE S/. \",'COSTOS UNITARIOS'!W56))","v":"ML DE REPARACIÓN DEL CANAL DE MAMANTEO A UN COSTO DE S/. 0"}]
[null,null,null,null,{"$f":"'8.ANALISIS TÉCNICO'!G124","v":"CONSTRUCCIÓN DE ZANJAS DE INFILTRACIÓN"},null,null,{"$f":"'8.ANALISIS TÉCNICO'!L124","v":0},{"$f":"IF(E49=\"\",\"\",CONCATENATE('COSTOS UNITARIOS'!R60,\" DE \",'8.ANALISIS TÉCNICO'!G124,\" A UN COSTO DE S/. \",'COSTOS UNITARIOS'!W60))","v":"ML DE CONSTRUCCIÓN DE ZANJAS DE INFILTRACIÓN A UN COSTO DE S/. 0"}]
[null,null,null,null,{"$f":"'8.ANALISIS TÉCNICO'!G125","v":"INSTALACIÓN DE QOCHAS"},null,null,{"$f":"'8.ANALISIS TÉCNICO'!L125","v":0},{"$f":"IF(E50=\"\",\"\",CONCATENATE('COSTOS UNITARIOS'!R64,\" DE \",'8.ANALISIS TÉCNICO'!G125,\" A UN COSTO DE S/. \",'COSTOS UNITARIOS'!W64))","v":"UNIDAD DE INSTALACIÓN DE QOCHAS A UN COSTO DE S/. 0"}]
[null,null,null,null,{"$f":"'8.ANALISIS TÉCNICO'!G127","v":"OTRO:"},null,null,{"$f":"'8.ANALISIS TÉCNICO'!L126","v":0},{"$f":"IF(E51=\"\",\"\",CONCATENATE('COSTOS UNITARIOS'!R71,\" DE \",'8.ANALISIS TÉCNICO'!G127,\" A UN COSTO DE S/. \",'COSTOS UNITARIOS'!W71))","v":" DE OTRO: A UN COSTO DE S/. 0"}]
[null,null,null,null,{"$f":"'6.PROBLEMA-OBJETIVO'!C119","v":"ADECUADAS PRÁCTICAS DEL MANEJO DEL ECOSISTEMA"}]
[null,null,null,null,{"$f":"'8.ANALISIS TÉCNICO'!G129","v":"CAPACITACIÓN EN GESTIÓN INTEGRADA DE RECURSOS HÍDRICOS CON ENFOQUE DE CUENCA"},null,null,{"$f":"'8.ANALISIS TÉCNICO'!L129","v":0},{"$f":"IF(E53=\"\",\"\",CONCATENATE('COSTOS UNITARIOS'!R74,\" DE \",'8.ANALISIS TÉCNICO'!G129,\" A UN COSTO DE S/. \",'COSTOS UNITARIOS'!W74))","v":"EVENTO DE CAPACITACIÓN EN GESTIÓN INTEGRADA DE RECURSOS HÍDRICOS CON ENFOQUE DE CUENCA A UN COSTO DE S/. 0"},null,null,null,null,null,null,null,null,null,null,null,null,null,null,"LA POBLACIÓN PARTICIPA ACTIVAMENTE EN LAS ACCIONES DE SENSIBILIZACIÓN, ASISTENCIA TÉCNICA Y CAPACITACIÓN"]
[null,null,null,null,{"$f":"'8.ANALISIS TÉCNICO'!G130","v":"ASISTENCIA TÉCNICA EN EL MANEJO DE ECOSISTEMAS DE INTERÉS HÍDRICO"},null,null,{"$f":"'8.ANALISIS TÉCNICO'!L130","v":0},{"$f":"IF(E54=\"\",\"\",CONCATENATE('COSTOS UNITARIOS'!R77,\" DE \",'8.ANALISIS TÉCNICO'!G130,\" A UN COSTO DE S/. \",'COSTOS UNITARIOS'!W77))","v":"EVENTO DE ASISTENCIA TÉCNICA EN EL MANEJO DE ECOSISTEMAS DE INTERÉS HÍDRICO A UN COSTO DE S/. 0"},null,null,null,null,null,null,null,null,null,null,null,null,null,null,"LAS AUTORIDADES PARTICIPAN ACTIVAMENTE EN LAS ACCIONES DE SENSIBILIZACIÓN, ASISTENCIA TÉCNICA Y CAPACITACIÓN"]
[null,null,null,null,{"$f":"'8.ANALISIS TÉCNICO'!G131","v":"CAPACITACIÓN EN BUENAS PRÁCTICAS PARA LA ADAPTACIÓN AL CAMBIO CLIMÁTICO Y GESTIÓN DE RIESGOS"},null,null,{"$f":"'8.ANALISIS TÉCNICO'!L131","v":0},{"$f":"IF(E55=\"\",\"\",CONCATENATE('COSTOS UNITARIOS'!R80,\" DE \",'8.ANALISIS TÉCNICO'!G131,\" A UN COSTO DE S/. \",'COSTOS UNITARIOS'!W80))","v":"TALLER DE CAPACITACIÓN EN BUENAS PRÁCTICAS PARA LA ADAPTACIÓN AL CAMBIO CLIMÁTICO Y GESTIÓN DE RIESGOS A UN COSTO DE S/. 0"},null,null,null,null,null,null,null,null,null,null,null,null,null,null,"LOS RECURSOS PARA LA EJECUCIÓN NO SON MODIFICADOS PARA OTRAS PRIORIDADES"]
[null,null,null,null,{"$f":"'8.ANALISIS TÉCNICO'!G132","v":"SENSIBILIZACIÓN RELACIONADA A LA RECUPERACIÓN DEL SERVICIO ECOSISTÉMICO DE REGULACIÓN HÍDRICA"},null,null,{"$f":"'8.ANALISIS TÉCNICO'!L132","v":0},{"$f":"IF(E56=\"\",\"\",CONCATENATE('COSTOS UNITARIOS'!R82,\" DE \",'8.ANALISIS TÉCNICO'!G132,\" A UN COSTO DE S/. \",'COSTOS UNITARIOS'!W82))","v":"TALLER DE SENSIBILIZACIÓN RELACIONADA A LA RECUPERACIÓN DEL SERVICIO ECOSISTÉMICO DE REGULACIÓN HÍDRICA A UN COSTO DE S/. 0"}]
[null,null,null,null,{"$f":"'8.ANALISIS TÉCNICO'!G133","v":"INTERCAMBIO DE EXPERIENCIAS RELACIONADA A LA RECUPERACIÓN DEL SERVICIO ECOSISTÉMICO DE REGULACIÓN HÍDRICA"},null,null,{"$f":"'8.ANALISIS TÉCNICO'!L133","v":0},{"$f":"IF(E57=\"\",\"\",CONCATENATE('COSTOS UNITARIOS'!R84,\" DE \",'8.ANALISIS TÉCNICO'!G133,\" A UN COSTO DE S/. \",'COSTOS UNITARIOS'!W84))","v":"EVENTO DE INTERCAMBIO DE EXPERIENCIAS RELACIONADA A LA RECUPERACIÓN DEL SERVICIO ECOSISTÉMICO DE REGULACIÓN HÍDRICA A UN COSTO DE S/. 0"}]
[null,null,null,null,{"$f":"'8.ANALISIS TÉCNICO'!G134","v":"OTRO:"},null,null,{"$f":"'8.ANALISIS TÉCNICO'!L134","v":0},{"$f":"IF(E58=\"\",\"\",CONCATENATE('COSTOS UNITARIOS'!R86,\" DE \",'8.ANALISIS TÉCNICO'!G134,\" A UN COSTO DE S/. \",'COSTOS UNITARIOS'!W86))","v":" DE OTRO: A UN COSTO DE S/. 0"}]
[null,null,null,null,{"$f":"'6.PROBLEMA-OBJETIVO'!C125","v":"ADECUADAS CAPACIDADES DE LAS ENTIDADES A CARGO DE LA GESTIÓN DEL ECOSISTEMA"}]
[null,null,null,null,{"$f":"'8.ANALISIS TÉCNICO'!G136","v":"CAPACITACIÓN A FUNCIONARIOS PÚBLICOS SOBRE LA GESTIÓN INTEGRADA DEL RECURSO HÍDRICO CON ENFOQUE DE CUENCA"},null,null,{"$f":"'8.ANALISIS TÉCNICO'!L136","v":0},{"$f":"IF(E60=\"\",\"\",CONCATENATE('COSTOS UNITARIOS'!R89,\" DE \",'8.ANALISIS TÉCNICO'!G136,\" A UN COSTO DE S/. \",'COSTOS UNITARIOS'!W89))","v":"TALLER DE CAPACITACIÓN A FUNCIONARIOS PÚBLICOS SOBRE LA GESTIÓN INTEGRADA DEL RECURSO HÍDRICO CON ENFOQUE DE CUENCA A UN COSTO DE S/. 0"}]
[null,null,null,null,{"$f":"'8.ANALISIS TÉCNICO'!G137","v":"CAPACITACIÓN A FUNCIONARIOS PÚBLICOS SOBRE LAS MEDIDAS DE ADAPTACIÓN EN UN CONTEXTO DE CAMBIO CLIMÁTICO EN LA GESTIÓN INTEGRADA DE LOS RECURSOS HÍDRICOS"},null,null,{"$f":"'8.ANALISIS TÉCNICO'!L137","v":0},{"$f":"IF(E61=\"\",\"\",CONCATENATE('COSTOS UNITARIOS'!R91,\" DE \",'8.ANALISIS TÉCNICO'!G137,\" A UN COSTO DE S/. \",'COSTOS UNITARIOS'!W91))","v":"TALLER DE CAPACITACIÓN A FUNCIONARIOS PÚBLICOS SOBRE LAS MEDIDAS DE ADAPTACIÓN EN UN CONTEXTO DE CAMBIO CLIMÁTICO EN LA GESTIÓN INTEGRADA DE LOS RECURSOS HÍDRICOS A UN COSTO DE S/. 0"}]
[null,null,null,null,{"$f":"'8.ANALISIS TÉCNICO'!G138","v":"DESARROLLO DE CAPACIDADES PARA EL MONITOREO Y SEGUIMIENTO DE LOS ECOSISTEMAS DE INTERÉS HÍDRICO Y EL SERVICIO ECOSISTÉMICO DE REGULACIÓN HÍDRICA"},null,null,{"$f":"'8.ANALISIS TÉCNICO'!L138","v":0},{"$f":"IF(E62=\"\",\"\",CONCATENATE('COSTOS UNITARIOS'!R93,\" DE \",'8.ANALISIS TÉCNICO'!G138,\" A UN COSTO DE S/. \",'COSTOS UNITARIOS'!W93))","v":"TALLER DE DESARROLLO DE CAPACIDADES PARA EL MONITOREO Y SEGUIMIENTO DE LOS ECOSISTEMAS DE INTERÉS HÍDRICO Y EL SERVICIO ECOSISTÉMICO DE REGULACIÓN HÍDRICA A UN COSTO DE S/. 0"}]
[null,null,null,null,{"$f":"'8.ANALISIS TÉCNICO'!G139","v":"INTERCAMBIO DE EXPERIENCIAS SOBRE LA GESTIÓN INTEGRADA DEL RECURSO HÍDRICO CON ENFOQUE DE CUENCA"},null,null,{"$f":"'8.ANALISIS TÉCNICO'!L139","v":0},{"$f":"IF(E63=\"\",\"\",CONCATENATE('COSTOS UNITARIOS'!R95,\" DE \",'8.ANALISIS TÉCNICO'!G139,\" A UN COSTO DE S/. \",'COSTOS UNITARIOS'!W95))","v":"EVENTO DE INTERCAMBIO DE EXPERIENCIAS SOBRE LA GESTIÓN INTEGRADA DEL RECURSO HÍDRICO CON ENFOQUE DE CUENCA A UN COSTO DE S/. 0"}]
[null,null,null,null,{"$f":"'8.ANALISIS TÉCNICO'!G140","v":"OTRO:"},null,null,{"$f":"'8.ANALISIS TÉCNICO'!L140","v":0},{"$f":"IF(E64=\"\",\"\",CONCATENATE('COSTOS UNITARIOS'!R97,\" DE \",'8.ANALISIS TÉCNICO'!G140,\" A UN COSTO DE S/. \",'COSTOS UNITARIOS'!W97))","v":" DE OTRO: A UN COSTO DE S/. 0"}]
[]
[]
[]
[]
[]
[]
[null,"(*) En relación a este indicador, en base a la definición de los lineamientos este es el indicador que mide el servicio ecosistémico de regulación hídrica, siendo el más idóneo en evaluar en la Matriz de Marco Lógico. Para su estimación se tiene el Método RAS, que se encuentra en la pestaña de \"COMUNICACIÓN TÉCNICA\" en la situación Con Proyecto (C/P). Cabe señalar que en la pestaña de \"UNIDAD PRODUCTORA\" y \"PROBLEMA-OBJETIVO\" se está considerando a las hectáreas recuperadas, debido al reporte del indicador de brecha de la tipología de proyecto. Ello no quiere decir que no se estime el nivel de ganancia hídrica de la recuperación de los ecosistemas, el cual se refleja en la Matriz del Marco Lógico. Del mismo modo, en caso que la Unidad Formuladora determine la necesidad de incluir otro indicador complementario al propuesto, se podría considerar el indicador de\"Hectáreas de ecosistema recuperado\" con el fin de lograr una mejor evaluación de resultados propuestos en el proyecto."]
[null,"* Para acceder a datos de estaciones meteorológicas del senamhi, deberá ingresar en el siguiente link: \nhttps://www.senamhi.gob.pe/?&p=descarga-datos-hidrometeorologicos"]
[]
[null,"* Para obtener mayor información sobre los indicadores de sequía, deberá ingresar al siguiente link:\nhttps://www.senamhi.gob.pe/?&p=sequias"]

{"sheet":"15.CONCLUS-RECOMEND","index":18,"n_rows":14,"n_cols":2,"rows_kept":14,"cut":false,"hidden":false,"merged":[[6,1,9,12],[13,1,16,12]]}
[]
[]
[]
[]
[]
[]
[null,"Se debe indicar el resultado del proceso de formulación y evaluación del proyecto (viable o no viable) y detallar los principales argumentos que sustentan dicho resultado, en términos de lo siguiente:\n- Cumplimiento de los tres atributos que definen la condición de viabilidad de un proyecto(*), en caso el proyecto resulte viable. Si el resultado es no viable, indicar qué  atributo o atributos no se logró cumplir.\n- Emitir un juicio técnico sobre la calidad y la pertinencia del grado de profundización de la información empleada para la elaboración del estudio de preinversión, así como la consistencia y coherencia de los supuestos establecidos, las fuentes de información, las normas técnicas, los parámetros y metodologías empleadas, entre otros elementos claves relacionados con el fundamento técnico y económico de la decisión de inversión."]
[]
[]
[]
[null,"(*)Ver literal q), artículo 2 del Reglamento del Decreto Legislativo N° 1252"]
[]
[]
[null,"Como resultado del proceso de elaboración del estudio de preinversión, la UF planteará recomendaciones técnicas para la UEI que asumirá la ejecución y posterior operación y mantenimiento, de corresponder. Tales recomendaciones deberán estar ligadas con las acciones o condiciones que se deberán asegurar para reducir o eliminar los riesgos que el proyecto podría enfrentar durante las siguientes fases del Ciclo de Inversiones. Principalmente, se deberá emitir como mínimo, recomendaciones sobre lo siguiente:\n\nFase de Ejecución\n- Las variables críticas que pueden influir en la estimación de los costos de  inversión, así como los plazos de ejecución del proyecto, de tal forma de generar alertas sobre posibles sobrecostos y sobreplazos durante la etapa de ejecución. Señalar las limitaciones de información que enfrentó la UF para realizar tales estimaciones.\n- Otros aspectos críticos que la UF juzgue conveniente resaltar, acorde con las restricciones de información que enfrentó durante la preparación del estudio de preinversión.\n\nFase de Funcionamiento\n- Las condiciones que podrían afectar la sostenibilidad del proyecto en general y  la entrega de servicios a la población beneficiaria en particular, en los aspectos financieros, presupuestales (asignación de la operación y mantenimiento), de cobros de tarifas, entre otros. Alertar sobre los riesgos de deterioro acelerado de los activos que se generan con el proyecto debido a un mantenimiento intermitente o insuficiente durante el periodo de funcionamiento del proyecto.\n- Otros aspectos críticos que la UF juzgue conveniente resaltar, acorde con las restricciones dde información que enfrentó durante la preparación del estudio de preinversión."]

{"sheet":"FIRMAS","index":19,"n_rows":21,"n_cols":10,"rows_kept":21,"cut":false,"hidden":false,"merged":[[12,9,12,10],[19,4,19,7],[19,9,19,10],[20,4,20,7],[12,1,12,3],[19,1,19,3],[12,4,12,7],[13,4,13,7]]}
[]
[]
[]
[]
[]
[]
[]
[]
[]
[]
[]
[]
[null,"Preparado o supervisado por:",null,null,"…………………………………………………………………………….",null,null,null,"Fecha:","……………………………………………………………………………."]
[null,null,null,null,"Especialista de la UF o Responsable de la UF"]
[]
[]
[]
[]
[]
[null,"Declarado viable por:",null,null,"…………………………………………………………………………….",null,null,null,"Fecha:","……………………………………………………………………………."]
[null,null,null,null,"Responsable de la UF"]

{"sheet":"PROTOCOLO FINAL","index":20,"n_rows":33,"n_cols":11,"rows_kept":33,"cut":false,"hidden":false,"merged":[[32,2,32,8],[6,2,6,8],[8,2,8,8],[10,2,10,8],[11,2,11,8],[12,2,12,8],[13,2,13,8],[14,2,14,8],[15,2,15,8],[16,2,16,8],[17,2,17,8],[28,2,28,8],[29,2,29,8],[30,2,30,8],[31,2,31,8],[23,2,23,8],[6,10,6,12],[19,2,19,8],[28,10,28,12],[20,10,20,12],[21,10,21,12],[22,10,22,12],[23,10,23,12],[24,10,24,12],[19,10,19,12],[8,10,8,12],[10,10,10,12],[11,10,11,12],[12,10,12,12],[13,10,13,12],[24,2,24,8],[25,2,25,8],[30,10,30,12],[31,10,31,12],[32,10,32,12],[25,10,25,12],[27,10,27,12],[7,1,7,12],[9,1,9,12],[18,1,18,12],[26,1,26,12],[29,10,29,12],[14,10,14,12],[15,10,15,12],[16,10,16,12],[17,10,17,12],[27,2,27,8],[20,2,20,8],[21,2,21,8],[22,2,22,8]]}
[]
[]
[]
[]
[]
[]
[null,"Número","Criterios de cumplimiento",null,null,null,null,null,null,"Sí","Comentarios"]
[null,"Alineamiento al cierre de una brecha prioritaria:"]
[null,1,"¿El proyecto de inversión contribuye a la meta de cierre de una brecha prioritaria?"]
[null,"Identificación"]
[null,2,"¿Se ha delimitado el terreno y definido sus características?"]
[null,3,"¿Han sido identificados los peligros naturales, socionaturales y antrópicos que podrían impactar sobre la infraestructura existente o sobre el proyecto durante su vida útil?"]
[null,4,"¿Se ha examinado la exposición y vulnerabilidad de la unidad productora  frente a peligros identificados en el área de estudio?"]
[null,5,"¿Se han identificado y caracterizado a la población afectada y otros agentes involucrados con el proyecto de inversión?"]
[null,6,"¿El problema central ha sido definido como una situación negativa o hecho real que afecta a un sector de la población? ¿Las causas explican el problema central? ¿Los efectos son consecuencias del problema identificado?"]
[null,7,"¿El objetivo central o propósito del proyecto expresa la solución del problema central y los medios definidos para el proyecto son suficientes para alcanzar el objetivo central?"]
[null,8,"¿Las acciones que contemplan las alternativas de solución se derivan del análisis de los medios fundamentales?"]
[null,9,"¿Las alternativas planteadas se basan en evidencia técnica, científica o experiencia de otros proyectos?"]
[null,"Formulación"]
[null,10,"¿El Horizonte de Evaluación del Proyecto ha sido adecuadamente determinado?"]
[null,11,"¿La opción tecnológica propuesta para el proyecto se encuentra adecuadamente justificada?"]
[null,12,"¿Las alternativas de solución están conforme y guardan correspondencia con los niveles de servicio y estándares de calidad establecidos por el sector competente? "]
[null,13,"¿Las alternativas consideran acciones para reducir los probables daños o pérdidas que podrían generar en caso de la ocurrencia de desastres?"]
[null,14,"¿Las alternativas consideran acciones para reducir el impacto ambiental que podría generar el proyecto?"]
[null,15,"¿El presupuesto de inversión de cada alternativa de solución está desagregado a nivel de acciones, actividades y tareas? ¿El presupuesto de inversión del proyecto ha incluido los costos de mitigación ambiental y riesgos?"]
[null,16,"¿Los costos de operación y mantenimiento tienen un razonable nivel de desagregación y se encuentran justificados en relación a la demanda por atender con el proyecto?"]
[null,"Evaluación"]
[null,17,"¿La metodología de evaluación social seleccionada (costo beneficio o costo efectividad) guarda correspondencia con la tipología de proyecto de inversión?"]
[null,18,"¿Han sido calculados los indicadores de evaluación social para cada alternativa de solución?"]
[null,19,"¿Se presenta el plan de implementación con las actividades necesarias (ruta crítica) para la ejecución del proyecto?"]
[null,20,"¿Se han definido los requerimientos institucionales y normativos que se deben cumplir durante la fase de ejecución y fase de funcionamiento?"]
[null,21,"¿Se han identificado los probables impactos positivos y/o negativos del proyecto en el ambiente?"]
[null,22,"¿Se ha definido quién financiará la operación y mantenimiento del proyecto?"]

{"sheet":"16.ANEXOS DE LA FICHA","index":21,"n_rows":25,"n_cols":15,"rows_kept":25,"cut":false,"hidden":false,"merged":[[13,2,13,13],[16,2,16,13],[0,1,0,3],[22,2,22,13],[21,2,21,13],[17,2,17,13],[18,2,18,13],[19,2,19,13],[20,2,20,13],[9,1,9,14],[14,2,14,13],[25,2,25,8],[25,9,25,14],[23,2,23,13],[24,2,24,13],[15,2,15,13]]}
[]
[]
[]
[]
[]
[]
[]
[]
[]
[null,"SECCIÓN N° 16: ANEXOS"]
[]
[null,"Marcas si se incluyen los siguientes anexos (según corresponda):"]
[]
[null,"Nro. ","Descripción del anexo",null,null,null,null,null,null,null,null,null,null,null,"Marcar"]
[null,1,"DOCUMENTO DE SUSTENTO DE USO PRIORITARIO"]
[null,2,"PLANO TOPOGRÁFICO O PLANO DE LA UBICACIÓN DEL TERRITORIO"]
[null,3,"ESTUDIO DE CARACTERIZACIÓN DEL SUELO, SEGÚN TIPO DE INTERES HÍDRICO"]
[null,4,"ACTUAL Y TENDENCIAS IDENTIFICACIÓN DE PELIGROS ASOCIADOS AL CAMBIO CLIMÁTICO"]
[null,5,"INFORME TÉCNICO HIDROLÓGICO DE CARACTERIZACIÓN DE LA CUENCA DONDE SE UBICA EL USUARIO"]
[null,6,"INFORME TÉCNICO DEL LEVANTAMIENTO FLORÍSTICO RÁPIDO DE LAS FORMACIONES VEGETALES DE LOS ECOSISTEMAS DE INTERES HÍDRICO"]
[null,7,"FICHAS DE MANEJO DE LOS ECOSISTEMAS DE INTERÉS HÍDRICO"]
[null,8,"FICHAS DE GESTIÓN INTEGRADA DEL SERVICIO ECOSISTÉMICO ANDINO RURAL"]
[null,9,"DOCUMENTACIÓN DE SANEAMIENTO FÍSICO-LEGAL"]
[null,10,"DOCUMENTO DE SUSTENTO DE ACUERDOS INSTITUCIONALES PARA LA OPERACIÓN Y MANTENIMIENTO (ACTA DE ACUERDO, CONVENIO MARCO, CONVENIO ESPECÍFICO, ENTRE OTROS)"]
[null,11,"PLANO DE INTERVENCIONES DEL PROYECTO"]

{"sheet":"UNIDAD HIDROGRÁFICA","index":22,"n_rows":25,"n_cols":2,"rows_kept":25,"cut":false,"hidden":false,"merged":[[24,1,24,12],[10,1,10,12],[12,1,12,12],[14,1,14,12],[16,1,16,12],[18,1,18,12],[20,1,20,12],[22,1,22,12]]}
[]
[]
[]
[]
[]
[]
[]
[]
[]
[]
[null,"Las definiciones que se presentan en este marco conceptual se encuentran relacionadas a la Unidad Hidrográfica y han sido adaptadas para su uso en proyectos de inversión."]
[]
[null,"DEFINICIONES RELACIONADAS A LA TIPOLOGÍA: ECOSISTEMAS"]
[]
[null,"a. Servicio ecosistémico de regulación hídrica: (1)\n\nEste servicio se origina cuando el ecosistema almacena agua en los periodos lluviosos y la libera lentamente en los periodos secos. Es decir, el ecosistema proporciona un balance natural entre caudales en época lluviosa con caudales de estiaje. A mayor capacidad de regulación, se espera un incremento del caudal base y una reducción en época de avenidas. La regulación hídrica depende principalmente de la intensidad y la estacionalidad de las precipitaciones, la cobertura vegetal, la profundidad del suelo, la alteración de la variabilidad climática y las prácticas de conservación de agua. "]
[]
[null,"b. Unidades hidrográficas: (2)\n\nEs un concepto creado por el ingeniero Otto Pfafstetter en 1989, cuando desarrolló su metodología de codificación. Son espacios geográficos limitados por líneas divisorias de aguas, relacionadas espacialmente por sus códigos, donde el tamaño de sus áreas de drenaje es el único criterio de organización jerárquica."]
[]
[null,"\nc. Cuenca hidrográfica: (3)\n\nÁrea delimitada por un límite topográfico bien definido (parte aguas). Es una zona geográfica donde las condiciones hidrológicas son tales que el agua se concentra en un punto en particular a partir del cual la cuenca se drena. Dentro de este límite topográfico, la cuenca presenta un complejo de suelos, geoformas, vegetación y uso de la tierra. \n"]
[]
[null,"d. Subcuenca: (4)\n\nConjunto de microcuencas que drenan a un solo cauce con caudal fluctuante pero permanente."]
[]
[null,"e. Microcuenca: (5)\n\nToda área en la que su drenaje va a dar al cauce principal de una subcuenca. Una subcuenca está dividida en varias microcuencas"]
[]
[null,"1. Lineamientos para la formulación de proyectos de inversión en las tipologías de ecosistemas, especies y apoyo al uso sostenible de la biodiversidad.\n2. Aprobado por Resolución Jefatural Nº 136-2018-ANA. Lineamientos para la identificación y seguimiento de fuentes contaminantes relacionadas con los recursos hídricos. (Pp. 22)\n3. Lineamientos para la formulación de proyectos de inversión en las tipologías de ecosistemas, especies y apoyo al uso sostenible de la biodiversidad.\n4. Lineamientos para la formulación de proyectos de inversión en las tipologías de ecosistemas, especies y apoyo al uso sostenible de la biodiversidad.\n5. Lineamientos para la formulación de proyectos de inversión en las tipologías de ecosistemas, especies y apoyo al uso sostenible de la biodiversidad."]

{"sheet":" TIPO DE ECOSISTEMAS PRINCIPAL","index":23,"n_rows":34,"n_cols":4,"rows_kept":34,"cut":false,"hidden":false,"merged":[[31,3,31,4],[32,3,32,4],[33,3,33,4],[21,3,21,4],[22,3,22,4],[23,3,23,4],[26,3,26,4],[27,4,30,4],[28,2,29,2],[7,3,7,4],[8,4,18,4],[9,2,18,2],[19,3,19,4],[20,3,20,4]]}
[]
[]
[]
[]
[]
[]
[]
[null,null,"Nombre del ecosistema","BOFEDAL"]
[null,null,"Definición propuesta","Ecosistema andino hidromórfico con vegetación herbácea de tipo hidrófila, que se presenta en los Andes sobre suelos planos, en depresiones o ligeramente inclinados; permanentemente inundados o saturados de agua corriente (mal drenaje), con vegetación densa y compacta siempreverde, de porte almohadillado o en cojín; la fisonomía de la vegetación corresponde a herbazales de 0,1 a 0,5 metros. Los suelos orgánicos pueden ser profundos (turba). Este tipo de ecosistema es considerado un humedal andino."]
[null,null,"Factores Diagnóstico","Región Natural: Andina."]
[null,null,null,"Bioclima: Húmedo/Superhúmedo."]
[null,null,null,"Fisiografía: Montaña."]
[null,null,null,"Rango referencial altitudinal: 3300 – 4500 m. s. n. m."]
[null,null,null,"Ecosistema hidromórfico andino y altoandino."]
[null,null,null,"Herbazales de 0,1 a 0,5 metro de altura."]
[null,null,null,"Vegetación densa y compacta siempreverde, de porte almohadillado o en cojín."]
[null,null,null,"Suele presentar dominancia de Distichia muscoides “champa” (pero no es concluyente), también Plantago rígida “champa estrella” y otras especies."]
[null,null,null,"Suelos planos o ligeramente inclinados."]
[null,null,null,"Suelos saturados o con espejo superficial de agua."]
[null,null,"Especies botánicas registradas","Distichia muscoides (“champa”), Plantago rígida (“champa estrella”), Oxychloe sp., Werneria caespitosa, Hypochoeris stenocephala, Luzula peruviana, Gentiana sedifolia, Alchemilla pinnata, Alchemilla diplophylla, Lilecopsis andina, Calamagrostis eminens, C. rigescens, C. jamesoni, Scirpus rigidus (“cuchipelo” o “totora silvestre”)."]
[null,null,"Fuentes","Dirección de Conservación de la Biodiversidad. Intendencia Forestal y de Fauna Silvestre, 2006, Salvador y Cano, 2002, Zeballos et al., 2010, MINAM, 2011, Flores et al., 2005, Gil Mora (sf), Dirección General de Evaluación, Valoración y Financiamiento del Patrimonio Natural, del Ministerio del Ambiente, 2011, Autoridad Nacional del Agua, (sf), Urrunaga, 2010, Huamantupa, 2010, Fernández–Baca, 1991, Tovar y Oscanoa, 2002, Tovar, 1973, Carafa, 2009, INRENA, 2007, Knight Piesold Consulting, 2007, Mostacero et al., 2008, Tupayachi, 2005, Gonzales et al., 2001, Beck, 1988, PROBONA, 1995, Navarro, 1993, Sarmiento, 2000, SERNANP, 2011, Bradt y Jarvis, 2002, Flores, (sf), Van't Hooft, 2004, Tovar, 1990, Parra et al., 2004, Rocha, (sf), Weberbauer, 1945, Mostacero et al., 2007, Flores, 2014, García y Beck, 2006, Mostacero et al., 2013, Izurieta, 2005, Tovar, 2012."]
[null,null,"Distribución en el país","Cajamarca, Piura, La Libertad, Ancash, Lima, Junín, Pasco, Huancavelica, Ayacucho, Apurímac, Arequipa, Cusco, Puno, Moquegua y Tacna."]
[null,null,"Localidad típica","Bofedales del Lago de Junín o Chinchaycocha (departamento de Junín), bofedales del Titicaca (departamento de Puno) y bofedales de Huancavelica."]
[null,null,"Observación","Rangos altitudinales referenciales varían de acuerdo a la latitud. Se sugiere recurrir a Indices de Termicidad en el proceso de mapeo. Ecosistema muy utilizado para pastoreo y otras actividades."]
[]
[]
[null,null,"Nombre del ecosistema","HUMEDALES Y LAGUNAS ALTOANDINAS"]
[null,null,"Definición propuesta","Superficies saturadas o cubiertas de aguas, sean de régimen natural o artificial, quietas/estancadas (sin circulación continua) o corrientes (movimiento continuo en una misma dirección), permanentes o temporales (al menos un mes de inundación), dulces, salobres o saladas. Son regulados por factores climáticos y en constante interrelación con los seres vivos que la habitan. El agua es el principal factor controlador del medio y la vida vegetal y animal asociada a éste. \n\nHumedales andinos (lagos y lagunas, manantiales o puquios y sistemas kársticos)."]
[null,null,"Factores diagnóstico","Superficies saturadas o cubiertas de aguas."]
[null,null,null,"El agua es el principal factor controlador del medio y la vida vegetal y animal asociada a éste."]
[null,null,"Especies botánicas registradas","Numerosas."]
[null,null,"Fuentes","Casallas y Gunkel, 2001, IDEAM Colombia, (sf), Scott y Carbonell, 1986, Sarmiento, 2000, Gonzales et al., 2001, ONERN y AID, 1986, SERNANP, 2011, Salvador y Cano, 2002, Mostacero et al., 2007, Tovar, 2012, La Torre y Aponte, 2009, Ramírez et al., 2010, Aponte y Ramírez 2011."]
[null,null,"Distribución en el país","Todo el país."]
[null,null,"Observación","Esta es una definición general que considera una variedad de humedales de manera intencional. Posteriormente el MINAM y la Autoridad Nacional del Agua (ANA) deben concordar definiciones específicas."]

{"sheet":"TIPO DE ECOSISTEMA ASOCIADO","index":24,"n_rows":187,"n_cols":3,"rows_kept":187,"cut":false,"hidden":false,"merged":[[184,2,184,3],[185,2,185,3],[186,2,186,3],[167,2,167,3],[168,2,168,3],[171,2,171,3],[172,3,182,3],[173,1,182,1],[183,2,183,3],[154,1,163,1],[162,2,162,3],[163,2,163,3],[164,2,164,3],[165,2,165,3],[166,2,166,3],[153,3,161,3],[146,2,146,3],[147,2,147,3],[148,2,148,3],[149,2,149,3],[152,2,152,3],[145,2,145,3],[118,3,127,3],[119,1,126,1],[128,2,128,3],[129,2,129,3],[130,2,130,3],[131,2,131,3],[134,2,134,3],[135,3,142,3],[136,1,144,1],[143,2,143,3],[144,2,144,3],[117,2,117,3],[93,2,93,3],[94,2,94,3],[95,2,95,3],[98,2,98,3],[99,3,107,3],[110,2,110,3],[111,2,111,3],[112,2,112,3],[113,2,113,3],[114,2,114,3],[73,2,73,3],[74,2,74,3],[75,2,75,3],[100,1,109,1],[108,2,108,3],[109,2,109,3],[77,2,77,3],[80,2,80,3],[81,3,90,3],[82,1,90,1],[91,2,91,3],[92,2,92,3],[76,2,76,3],[64,2,64,3],[65,3,72,3],[46,3,54,3],[47,1,56,1],[56,2,56,3],[57,2,57,3],[58,2,58,3],[59,2,59,3],[60,2,60,3],[61,2,61,3],[66,1,72,1],[60,1,61,1],[55,2,55,3],[7,1,8,1],[7,2,8,3],[9,3,17,3],[10,1,16,1],[18,2,18,3],[44,1,45,1],[44,2,45,3],[24,1,25,1],[24,2,25,3],[26,3,34,3],[27,1,36,1],[35,2,35,3],[36,2,36,3],[37,2,37,3],[38,2,38,3],[39,2,39,3],[40,1,41,1],[40,2,40,3],[39,8,39,9],[40,6,40,7],[41,2,41,3],[19,2,19,3],[20,2,20,3],[21,2,21,3]]}
[]
[]
[]
[]
[]
[]
[]
[null,"Nombre del ecosistema","PARAMO"]
[]
[null,"Definición propuesta","Ecosistema andino, del norte del país, con vegetación herbácea y arbustiva emplazado sobre paisajes con presencia de lluvias estacionales y lloviznas persistentes a lo largo de todo el año y con fluctuaciones diarias marcadas de temperatura. Suelos profundos saturados e hidromórficos. La fisonomía corresponde a herbazales de 1 a 1,5 metros entremezclados con arbustos de 1 a 3 metros con individuos emergentes de hasta 4 o 5 metros. Presenta endemismos y relativamente alta riqueza de especies de flora."]
[null,"Factores Diagnóstico","Región Natural: Andina."]
[null,null,"Bioclima: Superhúmedo."]
[null,null,"Fisiografía: Montaña"]
[null,null,"Rango referencial altitudinal: de 3000 m. s. n. m."]
[null,null,"Ecosistema de alta montaña."]
[null,null,"Herbazales de 1 a 1,5 metros de alto entremezclados con arbustos de 1 a 3 metros alto (con individuos emergentes de hasta 4 o 5 metros)."]
[null,null,"Cobertura del suelo suele ser superior al 35 %."]
[null,"Especies botánicas registradas","Neurolepis aristata, Paspalum bompladianum, Agrostis tolucensis, Calamagrostis spp., Festuca spp., Pernetya spp., Cavendishia spp., Baccharis genistelloides."]
[null,"Fuentes","Marcelo et al., 2006, Llambí y Cuesta, 2014, Sánchez, 2014, Armijos y De Bièvre, 2014, Rodríguez–Morales et al., 2014, Cammeraat et al., 2014, Tovar et al., 2014, Torres, 2005, Gobierno Regional de Cajamarca, 2012, Hofstede et al., 2003, Mena y Hofstede, 2006, Tobón 2009, Novoa et al., 2011, Ministerio del Medio Ambiente, 2002, Hofstede et al., 2014, Beltrán et al., 2009, Cadenillas, (sf), More, 2010, Viñas, 2013, Proyecto Páramo Andino Perú, 2010, Amanzo et al., 2003, Recharte et al., 2010, Rizo y Trama, 2007, INRENA, 2007, Vásquez y Buitrago, 2011, Ministerio de Ambiente y Desarrollo Sostenible, (sf), Maldonado, 2014, Elliot, 2009, Torres y López, 2009. Tena et al., 2012, Tapia, 1997, García y Beck, 2006, Órgano de Difusión del Grupo de Trabajo en Paramos del Ecuador, 2010, Izurieta, 2005, Watson, 2009, Sabogal, 2015, Consultores Asociados en Naturaleza y Desarrollo, CANDES, 2015."]
[null,"Distribución en el país","Piura y Cajamarca."]
[null,"Localidad típica","Cuencas de los ríos Quiroz, Piura, Huancabamba y Chinchipe."]
[null,"Observación","No hay."]
[]
[]
[null,"Nombre del ecosistema","PAJONAL DE PUNA SECA"]
[null,"Definición propuesta"]
[null,"Definición propuesta","Ecosistema altoandino con vegetación herbácea, que puede ocupar terrenos planos u ondulados o colinas de pendiente suave a moderada; el suelo tiene textura areno - limosa con bajo contenido de materia orgánica; cobertura de suelo inferior al 35 %, altura máxima generalmente no supera 1,5 metros. El clima es marcadamente estacional, con una época seca muy intensa, que se acentúa notablemente hacia el sur y hacia el oeste. Constituida generalmente por céspedes dominados por gramíneas de porte bajo y pajonales dominados por gramíneas amacolladas robustas, xeromórficas, a menudo con hojas rígidas, duras y punzantes, con presencia variable de arbustos resinosos, intercalándose vegetación saxícola en los afloramientos rocosos (está típicamente asociado a los arbustos) y canllares (formaciones de Margyricarpus sp.). Una comunidad notable está conformada por los rodales de Puya raimondii."]
[null,"Factores Diagnóstico","Región Natural: Andina."]
[null,null,"Bioclima: Sub húmedo"]
[null,null,"Fisiografía: Montaña"]
[null,null,"Rango referencial altitudinal: De 3 800 hasta 4 500 m. s. n. m."]
[null,null,"Ecosistema altoandino."]
[null,null,"Herbazales cuya altura máxima generalmente no supera 1,5 metros."]
[null,null,"Cobertura de suelo suele ser superior al 35%"]
[null,null,"Pajonales dominados por gramíneas de los géneros Festuca, Jarava (=Stipa) y Deyeuxia con presencia variable de matorrales resinosos (con Baccharis sp., Senecio sp., Fabiana sp. y Azorella sp.)."]
[null,null,"Fuerte asociación con matorrales muy densos."]
[null,null,"  Pueden ocupar terrenos planos u ondulados o colinas de pendiente suave a moderada."]
[null,"Especies botánicas registradas","Parastrephia lepidophylla, P. quadrangularis, Fabiana ramulosa, F. stephanii, Baccharis sp., Junellia arequipense, J. juniperina, Mutisia orbygniana, Adesmia atacamensis, A. spinosissima, Anthobryum triandrum, Arenaria serpens, Chersodoma arequipensis, Diplostephium tacorense, Puccinellia frigida, Senecio spinosus, Xenophyllum poposum, Margyricarpus sp., Puya raimondii, Azorella compacta, Festuca orthophylla, Jarava (=Stipa) spp., Deyeuxia spp., Echinopsis pamparuizii, Opuntia corotilla, O. ignescens, O. soehrensii, Oreocereus hempelianus. "]
[null,"Fuentes","Dirección General de Evaluación, Valoración y Financiamiento del Patrimonio Natural, del Ministerio del Ambiente, 2011, Tovar y Oscanoa, 2002, Flores et al., 2005, INRENA, 2007, Salvador, 2002, FAO, 1991, Machaca et al., 2010, Parra et al., 2004, Knight Piésold, 2007, Chávez, (sf), Zeballos et al., 2010, Quipuscoa y Huamantupa, 2010, Talavera et al., 2010, Urrunaga, 2010, Servat et al., 2010, Tovar, 1973, Gonzales et al., 2001, Young y Cano, 1994, Quispe, 2001, Vera, 2001, Tapia y Flores, 1984, FAO, 2010, Llosa et al., 2009, Olivera, 2000, Sarmiento, 2000, Tupayachi, 2005, Puignau, 1990, Bradt y Jarvis, 2002, Weberbauer y Harling, 1979, Jorgensen y Ulloa, 1994, Pittier, 1920, Acosta Solís, 1962, Morello y Adámoli, 1968, Pulgar Vidal, 1976, Rangel, 1995, Acosta Solis, 1968, Gonzáles et al., 1990, PROBONA, 1995, Monasterio, 1980, Diels, 1938, Environmental Hygiene & Safety SRL, 2010, MASAL, 2007, Reátegui y Martínez, 2010, NatureServe, 2009, Cuya, 1992, Teiller, 1998, Izco et al., 2007, FAO, 2000, Josse et al., 2009, Josse et al., 2007, Genin y Alzérreca, 2006, Weberbauer, 1945, Tovar, 1990, Mostacero et al., 2007, Tovar, 2012."]
[null,"Distribución en el país","Ayacucho, Apurímac, Arequipa, Cusco, Puno, Moquegua y Tacna."]
[null,"Localidad típica","Pampa Caleras (departamento de Ayacuch) y Huaytará (Huancavelica) "]
[null,"Observación","La Puna Seca en el Perú abarca las zonas del altiplano donde llegan con dificultad las lluvias de procedencia amazónica, desde el sur del departamento de Ayacucho hasta la frontera internacional con la República de Bolivia. Ecosistema muy utilizado para pastoreo y otras actividades."]
[]
[]
[null,"Nombre del ecosistema","PAJONAL DE PUNA HÚMEDA"]
[null,"Definición propuesta"]
[null,"Definición propuesta","Ecosistema altoandino con vegetación herbácea constituida principalmente por céspedes dominados por gramíneas de porte bajo y pajonales dominados por gramíneas que crecen amacolladas, dispersas y son de tallo y hojas duras, y algunas asociaciones arbustivas dispersas; intercalándose vegetación saxícola en los afloramientos rocosos. Puede ocupar terrenos planos u ondulados o colinas de pendiente suave a moderada. Presenta una cobertura de 35 – 50 % y altura generalmente no supera 1,5 metros. Una comunidad notable está conformada por los rodales de Puya raimondii."]
[null,"Factores Diagnóstico","Región Natural: Andina."]
[null,null,"Bioclima: Húmedo/Superhúmedo."]
[null,null,"Fisiografía: Montaña."]
[null,null,"Rango referencial altitudinal: 3800 – 4500 m. s. n. m."]
[null,null,"Ecosistema altoandino."]
[null,null,"Herbazales cuya altura máxima generalmente no supera 1,5 metros."]
[null,null,"Cobertura de suelo suele ser superior al 35 %."]
[null,null,"Pajonales dominados por gramíneas de los géneros Festuca, Jarava (=Stipa), Deyeuxia y Poa, y algunos matorrales (con Baccharis sp. y Berberis sp.)."]
[null,null,"Pajonales asociados a bosques densos de Polylepis sp. y arbustales."]
[null,null,"Pueden ocupar terrenos planos u ondulados o colinas de pendiente suave a moderada."]
[null,"Especies botánicas registradas","Chuquiraga spinosa, Baccharis spp., Berberis sp., Ageratina sternbergiana, Bartsia camporum, B. patens, Calceolaria spp., Cheilanthes scariosa, Clematis peruviana, Eremocharis integrifolia, Helogyne ferreyrae, Jaltomata bicolor, Lupinus ballianus, Peperomia naviculaefolia, Villadia reniformis, Puya raimondii, Festuca spp., Jarava (=Stipa) spp., Calamagrostis spp., Deyeuxia spp., Poa spp., Matucana haynei"]
[null,"Fuentes","Dirección General de Evaluación, Valoración y Financiamiento del Patrimonio Natural, del Ministerio del Ambiente, 2011, Tovar y Oscanoa, 2002, Flores et al., 2005, INRENA, 2007, Salvador, 2002, FAO, 1991, Machaca et al., 2010, Parra et al., 2004, Knight Piésold, 2007, Chávez, (sf), Zeballos et al., 2010, Quipuscoa y Huamantupa, 2010, Talavera et al., 2010, Urrunaga, 2010, Servat et al., 2010, Tovar, 1973, Gonzales et al., 2001, Young y Cano, 1994, Quispe, 2001, Vera, 2001, Tapia y Flores, 1984, FAO, 2010, Llosa et al., 2009, Olivera, 2000, Sarmiento, 2000, Tupayachi, 2005, Puignau, 1990, Bradt y Jarvis, 2002, Weberbauer y Harling 1979, Jorgensen y Ulloa, 1994, Pittier, 1920, Acosta Solís, 1962, Morello y Adámoli, 1968, Pulgar Vidal, 1976, Rangel, 1995, Acosta Solis, 1968, Gonzáles et al., 1990, PROBONA, 1995, Monasterio, 1980, Diels, 1938, Environmental Hygiene & Safety SRL, 2010, MASAL, 2007, Reátegui y Martínez, 2010, NatureServe, 2009, Cuya, 1992, Teiller, 1998, Izco et al., 2007, FAO 2000, Josse et al., 2009, Josse et al., 2007, Genin y Alzérreca, 2006, Weberbauer, 1945, Tovar, 1990, Mostacero et al., 2007, Tovar, 2012."]
[null,"Distribución en el país","La Libertad, Ancash, Lima, Junín, Pasco, Huancavelica, Ayacucho."]
[null,"Localidad típica","Pampa de Bombón (Reserva Nacional Junín, departamento de Junín) y  Carpa (Parque Nacional Huascarán, departamento de Ancash)."]
[null,"Observación","La Puna Húmeda se localiza desde el norte y centro de los Andes y las alturas de las cordilleras y el norte del Altiplano, en la cuenca del lago Titicaca. Ecosistema muy utilizado para pastoreo y otras actividades."]
[]
[]
[null,"Nombre del ecosistema","JALCA"]
[null,"Definición propuesta","Ecosistema andino transicional, del norte del país, con vegetación herbácea y arbustiva húmeda enclavada en un paisaje con características climáticas intermedias entre el Páramo y la Puna Húmeda; con condiciones más húmedas que en la Puna, pero no presenta lluvias tan intensas, ni una atmósfera tan nublada como en el Páramo. La fisonomía corresponde a herbazales de 1 a 1,5 metros entremezclados con arbustos de 1 a 3 metros. Si bien comparte especies botánicas tanto con el Páramo como con la Puna Húmeda posee riqueza de endemismos de los géneros Agrostis, Poa, Festuca, Arcytophyllum, entre otros. A diferencia del Páramo, cuya orografía establece un paisaje discontinuo (como islas en las cumbres de las cordilleras); en la Jalca, el paisaje es continuo."]
[null,"Factores diagnóstico","Región Natural: Andina."]
[null,null,"Bioclima: Húmedo/Superhúmedo."]
[null,null,"Fisiografía: Montaña."]
[null,null,"Rango referencial altitudinal: Encima de 3000 m. s. n. m."]
[null,null,"Ecosistema altoandino húmedo."]
[null,null,"Herbazales de 1 a 1,5 metros entremezclados con arbustos de 1 a 3 metros con individuos emergentes de hasta 4 – 4,5 metros."]
[null,null,"Cobertura del suelo superior al 35 %."]
[null,"Especies botánicas registradas","Calamagrostis tarmensis, Calceolaria cajabambae, Geranium peruvianum, Hieracium peruanum, Hypericum laricifolium, Jungia stuebelii, Muhlenbergia caxamarcensis, Paranephelius ferreyri, Tridax peruviensis, Agrostis spp., Poa spp., Festuca spp., Arcytophyllum spp., Juncus sp., Werneria spp., Luzula spp., Geranium spp., Elaphoglossum spp., Plantago sp., Vaccinium sp., Phyllactis sp., Brachyotum spp., Hypericum spp., Siphocampylus sp."]
[null,"Fuentes","Tovar et al., 2014, Sánchez–Vega y Dillon, 2006, Gobierno Regional de Cajamarca, 2012, Sánchez–Vega, 1997, Mena y Hofstede, 2006, Sánchez–Vega, 2009, Tapia, 1997, Gobierno Regional de Cajamarca, 2011, Vásquez y Buitrago, 2011, Schjellerup et al., 1999, Rodríguez, 1997, El Grupo en Páramo, Jalcas y Punas del Perú, (sf), Órgano de difusión del Grupo de Trabajo en Paramos del Ecuador (GTP), 2010, Izurieta, 2005, Galán de Mera et al., 2015, Consultores Asociados en Naturaleza y Desarrollo CANDES, 2015."]
[null,"Distribución en el país","Cajamarca, Amazonas, La Libertad y  norte de Huánuco (principalmente en las cuencas de los ríos Huallabamba, Utcubamba, Mayo y Huallaga)."]
[null,"Localidad típica","Jalca Grande (departamento de Amazonas) y Udima (departamento de Cajamarca)."]
[null,"Observación","Se requiere evaluar si realmente se trata de un ecosistema distinto al Páramo, pues existe controversia entre los especialistas desde hace varios años."]
[]
[]
[null,"Nombre del ecosistema","MATORRAL DE PUNA SECA"]
[null,"Definición propuesta","Ecosistema andino (tolar y otros) abierto a semidenso (20 a 40 % de cobertura) que se encuentra en lugares planos a casi planos y con suelo arenoso. La fisonomía corresponde a un matorral o arbustal de 0,3 a 1,5 metros de altura, asociado a gramíneas; las hojas pequeñas, coriáceas, resinosas y suculentas. Formación arbustiva singular de los Andes del sur del país (Puna Seca); ocupa áreas extensas y está dominada por arbustos de “tola” (Parastrephia spp.), así como Lepidophyllum quadrangulare, Baccharis spp. y otras especies."]
[null,"Factores Diagnóstico","Región Natural: Andina."]
[null,null,"Bioclima: Subhúmedo."]
[null,null,"Fisiografía: Montaña."]
[null,null,"Rango referencial altitudinal: 2400 – 4500 m. s. n. m."]
[null,null,"Matorral altoandino."]
[null,null,"Matorral o arbustal de 0,3 a 1,5 metros de altura."]
[null,null,"Abierto a semidenso (20 a 40 %)."]
[null,null,"Terrenos planos a casi planos y con suelo arenoso."]
[null,null,"Áreas extensas dominadas por “tola” (Parastrephia spp.), además de Lepidophyllum quadrangulare, Baccharis spp. y otras especies."]
[null,"Especies botánicas registradas","Parastrephia spp. (“tola”), Lepidophyllum quadrangulare (“tola”), Baccharis tricuneata, B. boliviensis, B. caespitosa, Diplostephium sp., Senecio spinosus, Aciachne pulvinata, Margyricarpus pinnatus, Conyza deserticola, Gomphrena meyeniana."]
[null,"Fuentes","Roque y Ramírez, 2008, Montesinos, 2012, Machaca et al., 2010."]
[null,"Distribución en el país","Puno, Tacna, Moquegua, Arequipa, Ayacucho y Huancavelica."]
[null,"Localidad típica","Pampa Galeras (departamento de Ayacucho), Quellaveco (departamento de Moquegua)."]
[null,"Observación","Por sugerencia de Carlos Reynel, el nombre de este ecosistema pasó de Matorral Altoandino a Matorral de Puna Seca."]
[]
[]
[null,"Nombre del ecosistema","BOSQUE RELICTO ALTOANDINO (queñoal y otros)"]
[null,"Definición propuesta","Ecosistema forestal constituido por bosque relicto altoandino dominado por asociaciones de “queuña” (Polylepis spp.), que se extienden por más de 0,5 hectáreas, con árboles de una altura superior a 2 metros y una cubierta del suelo superior al 10 %; comúnmente restringidos a laderas rocosas o quebradas; distribución actual en parches o islas de vegetación."]
[null,"Factores Diagnóstico","Región Natural: Andina."]
[null,null,"Bioclima: Húmedo."]
[null,null,"Fisiografía: Montaña."]
[null,null,"Rango referencial altitudinal: generalmente 3000 – 5000 m. s. n. m."]
[null,null,"Ecosistema forestal altoandino."]
[null,null,"Arboles con altura mínima: 2 metros."]
[null,null,"Cobertura del suelo superior a 10 %."]
[null,null,"Pendientes medianas–fuertes, quebradas, terrenos rocosos o pedregosos."]
[null,null,"Superficie mínima: Media hectárea."]
[null,null,"Predominancia de individuos de Polylepis spp."]
[null,"Especies botánicas registradas","Polylepis spp., Diplostephium sp., Baccharis tricuneata, B. genistellodies, Parastrephia lepidophylla, Chuquiraga spinosa, Lupinus sp., Pycnophyllum molle, Margyricarpus pinnatus, Chersodoma sp., Heliotropus sp., Opuntia floccosa, Adesmia spinosissima, Chersodoma sp., Festuca spp., Jarava spp."]
[null,"Fuentes","Dirección General de Evaluación, Valoración y Financiamiento del Patrimonio Natural, del Ministerio del Ambiente, 2011, Aramayo et al., 2004, Carretero et al., 2002, Servat et al., 2002, Rangel y Arellano, 2007, Rada et al., 2007, ABC y ProAves, 2007, Ministerio de Ambiente, Vivienda y Desarrollo Territorial, 2010, Urrunaga, 2010, Mendoza et al., 2010, Talavera et al., 2010, Fernández et al., 2001, Fundación ProAves, 2009, Yallico, 1992, Balderrama y Ramírez, 2001, Kessler, 2006, ECOAN, 2006, Flores et al., 2009, Tovar, 1973, Fjeldsa, 1992, Barreda, 1951, Herrera, 1943, INRENA, 2006, Tupayachi, 2005, Gonzáles et al., 2001, Monasterio, 1980, Hueck, 1978, Seibert, 1993, Hueck, 1960, Ruthsatz y Movia, 1975, Ulloa y Jorgensen, 1993, Gonzales et al., 1990, Jorgensen y Ulloa, 1994, Bekker y Cleef, 1989, Cleef et al., 1983, Sarmiento, 1974, Franco et al., 2009, Flores et al., 2009, Giles et al., 1970, Aróstegui y Sato, 1970, NatureServe, 2009, Galiano y Tupayachi, 1997, Cuya et al., 1992, Lao et al., 1990, FRA (The Forest Resources Assessment) of FAO, 2000, Renison et al., 2002, Figuero y Rafael, 2011, Martino et al., 2011, Blanco y Gamero, 2010, Silva y Kerrigan, 2010, Josse et al., 2009, Josse et al., 2007, Mendoza y Cano, 2011, Mendoza, 2005, Moya y Lara, 2011, Gómez y Molina, 2007, Mendoza y A. Cano, 2012, Mostacero et al., 2007, Dirección de Conservación de la Biodiversidad Intendencia Forestal y de Fauna Silvestre, 2006, Tovar, 2012."]
[null,"Distribución en el país","Cajamarca, La Libertad, Ancash, Lima, Junín, Pasco, Huancavelica, Ayacucho, Apurímac, Cusco, Arequipa, Moquegua, Puno y Tacna."]
[null,"Localidad típica","Llanganuco, Parque Nacional Huascarán (departamento de Ancash) y Lampa (departamento de Puno)."]
[null,"Observación","La caracterización de altura y densidad de los árboles y de superficie mínima se enmarca en la definición establecida por MINAM el año 2012"]
[]
[]
[null,"Nombre del ecosistema","BOSQUE RELICTO MONTANO DE VERTIENTE OCCIDENTAL"]
[null,"Definición propuesta","Ecosistema húmedo constituido por bosques relicto de las vertientes occidentales de los Andes del norte del país, distribuidos entre los 1400 y 3000 m.s.n.m. La fisonomía corresponde a un bosque denso generalmente nublado con altura de dosel de hasta 15 metros con árboles emergentes de 20 metros y abundantes epífitas."]
[null,"Factores diagnóstico","Región Natural: Andina."]
[null,null,"Bioclima: Húmedo."]
[null,null,"Fisiografía: Montaña."]
[null,null,"Rango referencial altitudinal: 1400 – 3000 m. s. n. m."]
[null,null,"Ecosistema forestal húmedo."]
[null,null,"Bosque denso generalmente nublado con altura de dosel de hasta 15 metros, con árboles emergentes de 20 metros."]
[null,null,"Variado complejo de formaciones florísticas."]
[null,null,"Bosques relictos de las vertientes occidentales de los Andes del norte del Perú."]
[null,"Especies botánicas registradas","Algunas especies botánicas características son: Oreopanax oroyanus (“calo”), Delostoma integrifolium (“putquero”), Escallonia angustifolia (“tasta”), Piper arboreum, P. acutifolium, Hydrocotyle sagasteguii, Asplundianthus sagasteguii, Barnadesia hutchisoniana, Euphorbia weberbaueri, Pitcairnia lopezii, Tillandsia rauhii. Cinchona, Podocarpus"]
[null,"Fuentes","Weigend et al,. 2006, Weigend et al., 2005, Flanagan et al., 2005, Llatas y López, 2005, Valencia, 1992."]
[null,"Distribución en el país","Piura, Lambayeque, La Libertad, Cajamarca y Ancash."]
[null,"Localidad típica","Monteseco y Udima, Refugio de Vida Silvestre Bosques Nublados de Udima (departamento de Cajamarca)."]
[null,"Observación","No hay."]
[]
[]
[null,"Nombre del ecosistema","BOSQUE RELICTO MESOANDINO"]
[null,"Definición propuesta","Ecosistema andino de composición y estructura variable, representado por comunidades puras o mixtas de Escallonia resinosa (“chachacoma” o “karkac”), Escallonia myrtilloides (“tasta”), Podocarpus glomeratus (“intimpa”) y Myrcianthes oreophila (“unka”) en las zonas más húmedas y Kageneckia lanceolata (“lloque”), Alnus acuminata (“aliso” o “lambrán”) y otras especies en las zonas más secas. Se extiende por más de 0,5 hectáreas, con árboles de una altura superior a 2 metros y una cobertura del suelo superior al 10 %; comúnmente distribuido como parches o islas de vegetación relictual restringidos a localidades especiales, en laderas montañosas con pendientes moderadas a fuertes."]
[null,"Factores diagnóstico","Región Natural: Andina."]
[null,null,"Bioclima: Subhúmedo."]
[null,null,"Fisiografía: Montaña."]
[null,null,"Rango referencial altitudinal: 2000 – 3500 m. s. n. m."]
[null,null,"Ecosistema forestal andino."]
[null,null,"Árboles de una altura superior a 2 metros."]
[null,null,"Cobertura del suelo superior a 10 %."]
[null,null,"Superficie mayor a 0,5 hectáreas Parches vegetación relictuales restringidos a localidades especiales, en laderas montañosas con pendientes moderadas a fuertes."]
[null,null,"Comunidades puras o mixtas de Escallonia resinosa (“chachacoma” o “karkac”), Escallonia myrtilloides (“tasta”), Podocarpus glomeratus (“intimpa”), Myrcianthes oreophila (“unka”), entre otras."]
[null,"Especies botánicas registradas","Escallonia resinosa (“chachacoma” o “karkac”), Escallonia myrtilloides (“tasta”), Podocarpus glomeratus (“intimpa”), Myrcianthes oreophila (“unka”), Kageneckia lanceolata (“lloque”) y Alnus acuminata (“aliso” o “lambrán”)."]
[null,"Fuentes","INRENA, 2003, Hostnig y Palomino, 1997, Dirección General de Evaluación, Valoración y Financiamiento del Patrimonio Natural, del Ministerio del Ambiente, 2011, Carretero et al., 2002, Piper et al., (sf), Tovar, 2012."]
[null,"Distribución en el país","Lima, Ancash, Junín, Pasco, Ayacucho, Huancavelica, Cusco y Puno."]
[null,"Localidad típica","Santuario Nacional Ampay (departamento de Apurímac)."]
[null,"Observación","Carlos Reynel sugiere que se divida este ecosistema en: Bosque Mesoandino Seco (con “lloque” Kageneckia sp.) y Bosque Mesoandino Húmedo (con “intimpa” Podocarpus sp. y otras)."]
[]
[]
[null,"Nombre del ecosistema","BOSQUE estacionalmente seco INTERANDINO (MARAÑON, MANTARO, PAMPAS Y APURÍMAC)"]
[null,"Definición propuesta","Ecosistema forestal que se caracteriza por estar dominado por comunidades arbóreas deciduas distribuidas a lo largo de los valles interandinos, incluyendo en el estrato inferior especies herbáceas de carácter estacional; las cactáceas de porte arbóreo son notorias, abundantes y mayormente endémicas. La fisonomía dominante corresponde a un bosque estacionalmente seco abierto sobre laderas, con individuos de hasta 7 u 8 metros. Su altitud va desde 500 hasta 2500 m. s. n. m. aproximadamente. Valles interandinos del Marañón–Huancabamba, Pampas, Apurímac, otros."]
[null,"Factores diagnóstico","Región Natural: Andina."]
[null,null,"Bioclima: Semiárido."]
[null,null,"Fisiografía: Montaña."]
[null,null,"Rango referencial altitudinal: 500 – 2500 m. s. n. m."]
[null,null,"Ecosistema forestal de valles interandinos."]
[null,null,"Bosque estacionalmente seco abierto sobre laderas, con individuos de hasta 7 u 8 metros."]
[null,null,"Dominado por comunidades arbóreas deciduas."]
[null,null,"En el estrato inferior especies arbustivas y herbáceas de carácter estacional."]
[null,null,"Cactáceas de porte arbóreo son notorias (Armatocereus rauhii, Brownigia altissima y Espostoa lanata)."]
[null,null,"Valles interandinos del Marañón–Huancabamba, Pampas, Apurímac, otros."]
[null,"Especies botánicas registradas","Eriotheca discolor, E. peruviana y E. vargasii (“pate” o “pati”), Vachellia macracantha (“faique” o “huarango”), Bougainvillea peruviana (“papelillo”), Pithecellobium excelsum (“chaquiro”), Parkinsonia praecox (“palo verde”), Leucaena trichodes (“chapra”), Sapindus saponaria (“choloque”), Colicodendron [=Capparis] scabridum (“sapote” o “sapotillo”), Melocactus bellavistensis (“asiento de suegra”), Armatocereus rauhii, Brownigia altissima, Espostoa lanata)."]
[null,"Fuentes","Comunidad Andina, 2009, Marcelo et al., 2007 y 2016, Aguirre et al., 2006, Carretero et al. 2002, Borsdorf et al., 2012, MINAM, 2012, Reynel et al., 2013, Palacios y Reynel, 2011, Quispe (sf), AMEC, 2011, MINAM y MINAG, 2011, MINAM, 2014, Tovar et al., 2013, Linares–Palomino, 2004 y 2006, Consultores Asociados en Naturaleza y Desarrollo CANDES, 2015."]
[null,"Distribución en el país","Lambayeque, Piura, Amazonas, Cajamarca, Huancavelica, Junín, Apurímac y Cusco."]
[null,"Localidad típica","Balsas (departamento de Amazonas)."]
[null,"Observación","No hay."]
[]
[]
[null,"Nombre del ecosistema","MATORRAL ANDINO"]
[null,"Definición propuesta","Ecosistema andino con rango altitudinal entre cerca de 1500 hasta 3900 m. s. n. m., con vegetación leñosa arbustiva de composición y estructura variable (incluyendo formaciones de cactáceas o cardonales), una cobertura de suelo superior al 10 %, que se extiende por más de 0,5 hectáreas y una altura sobre el suelo que no supera los 4 metros. Incluye árboles de manera dispersa."]
[null,"Factores diagnóstico","Región Natural: Andina."]
[null,null,"Bioclima: Árido/Húmedo."]
[null,null,"Fisiografía: Montaña"]
[null,null,"Rango referencial altitudinal: 1500 – 3900 m. s. n. m."]
[null,null,"Ecosistema andino."]
[null,null,"Vegetación leñosa arbustiva no supera 4 metros de altura."]
[null,null,"Cobertura de suelo superior al 10 %."]
[null,null,"Se extiende por más de 0,5 hectáreas."]
[null,null,"Composición y estructura variable (incluyendo cactáceas)."]
[null,null,"Incluye árboles de manera dispersa."]
[null,"Especies botánicas registradas","Kageneckia lanceolata (“lloque”), Mutisia acuminata (“chinchircuma”), Barnadesia dombeyana (“yaulli”), Tecoma stans (“huaranhuay”), Caesalpinia spinosa (“tara”), Schinus molle (“molle”), Opuntia subulata (“anjokishka”) y Pitcairnia spp., Puya spp."]
[null,"Fuentes","INRENA, 2007, Parra et al., 2004, Knight Piésold, 2007, Talavera et al., 2010, Quispe, 2001, Josse et al., 2009, Sarmiento, 2000, Bradt y Jarvis, 2002, Tamayo, 1958, Rangel, 1995, ONERN, 1976, Dirección General de Evaluación, Valoración y Financiamiento del Patrimonio Natural, del Ministerio del Ambiente, 2011, Torres, 2001, Environmental Hygiene & Safety SRL, 2010, MASAL, 2007, Reátegui y Martínez, 2010, NatureServe, 2009, Cuya et al., 1992, Martínez, 1985, Parra et al., 2004, FAO, 2000, Josse et al., 2007, Murcia y Ochoa, 2012, Weberbauer, 1945, Tovar, 2012."]
[null,"Distribución en el país","Cajamarca, La Libertad, Piura, Ancash, Lima, Junín, Pasco, Huancavelica, Ayacucho, Apurímac, Cusco, Arequipa, Moquegua, Puno y Tacna."]
[null,"Observación","No hay."]

{"sheet":"ZONAS PRIORIZADAS","index":25,"n_rows":21,"n_cols":2,"rows_kept":21,"cut":false,"hidden":false,"merged":[[14,1,14,12],[16,1,16,12],[17,1,17,12],[19,1,19,12],[20,1,20,12],[7,1,7,12],[8,1,8,12],[10,1,10,12],[11,1,11,12],[13,1,13,12]]}
[]
[]
[]
[]
[]
[]
[]
[null,"Humedales reconocidos en el Perú por la Convención Relativa a los Humedales de Importancia Internacional (RAMSAR)"]
[null,"Los RAMSAR con ecosistemas andinos rurales son: Reserva Nacional de Junín (Junín y Pasco), Lago Titicaca (Puno), Bofedales y Laguna de Salinas (Arequipa), Laguna del Indio-Dique de los Españoles (Arequipa), Humedal Lucre-Huarcapay (Cusco) y Lagunas Las Arreviatadas (Cajamarca)."]
[]
[null,"Áreas de conservación ambiental"]
[null,"En caso de elegir la opción de “área de conservación ambiental”, se debe anexar la ordenanza provincial de reconocimiento."]
[]
[null,"Zonas de protección y conservación ecológica\nZonas de recuperación identificadas en los procesos de zonificación ecológica económica aprobados por el MINAM"]
[null,"En caso de elegir la opción “zonas de protección y conservación ecológica” o “Zona de recuperación”, se debe contar con el documento que las determina como tal, en el marco de la Ley N° 29763, Ley Forestal y  de Fauna Silvestre, y sus respectivos Reglamentos."]
[]
[null,"Áreas Naturales Protegidas"]
[null,"En caso el ecosistema a intervenir forme parte de una “Área Natural Protegida” de carácter nacional o regional, se debe anexar su documento de creación."]
[]
[null,"Zonas priorizadas por los Sistemas Regionales de Conservación"]
[null,"En caso elegir la opción “Zonas priorizadas por los sistemas regionales de conservación”, se debe anexar la ordenanza o documento que las determine como tal."]

{"sheet":"ORIENTACIONES TERRITORIO","index":26,"n_rows":63,"n_cols":2,"rows_kept":63,"cut":false,"hidden":false,"merged":[[59,1,59,13],[54,1,54,13],[55,1,55,13],[57,1,57,13],[48,1,48,13],[49,1,49,13],[50,1,50,13],[56,1,56,13],[52,1,52,13],[53,1,53,13],[51,1,51,13],[7,1,7,13],[9,1,28,13],[31,1,31,13],[63,2,63,11],[58,1,58,11],[35,1,35,13],[33,1,33,13],[36,1,36,13],[37,1,37,13],[38,1,38,13],[41,1,41,13],[42,1,42,13],[43,1,43,13],[44,1,44,13],[47,1,47,13],[62,1,62,13]]}
[]
[]
[]
[]
[]
[]
[]
[null,"Para la identificación del territorio se usará información primaria y secundaria; según sea el caso de la cuenca, se recomienda el desarrollo del siguiente proceso de diagnóstico:"]
[]
[null,"ESQUEMA DEL PROCESO METODOLÓGICO"]
[]
[]
[]
[]
[]
[]
[]
[]
[]
[]
[]
[]
[]
[]
[]
[]
[]
[]
[]
[]
[]
[null,"FUENTES DE INFORMACIÓN\nPara poder realizar los procesos se puede recopilar información primaria y secundaria de las diferentes actores involucrados en la cuenca, como por ejemplo de la ALA, AAA, GORE, SENAMHI, GL, ONG, y del usuario del agua del cual se realiza el estudio."]
[]
[null,"DETALLE DEL PROCESO METODOLÓGICO PARA LA IDENTIFICACIÓN DEL AREA DE ESTUDIO"]
[]
[null,"A.   Caracterizar hidrológicamente la cuenca donde se ubica el usuario"]
[null,"i.  Describir la ubicación de la cuenca donde se ubica el usuario del agua."]
[null,"ii. Colocar el mapa respectivo, que indique espacialmente los ríos, las principales fuentes de agua del usuario, los centros poblados en la cuenca y las comunidades donde se encuentran las principales fuentes identificadas."]
[null,"iii. Describir la curva hipsométrica de la cuenca de estudio, las órdenes de los ríos, los caudales existentes del río principal y la delimitación de las zonas priorizadas que se ubican en la cuenca, así como realizar su especialización en el mapa de la cuenca, si tiene plan de manejo en que estado se encuentra su gestión."]
[]
[]
[null,"B.      Describir y analizar el usuario de agua (demandante)"]
[null,"i. Describir al usuario de agua que es demandante del proyecto."]
[null,"ii. Indicar la existencia de otros usuarios de agua en la Cuenca."]
[null,"iii. Identificar los problemas de los usuarios en época de estiaje y de avenida. Determinar los meses de estiaje y de avenida."]
[]
[]
[null,"C.      Describir y analizar las principales fuentes agua superficial para el usuario."]
[null,"i. Describir el punto de captación y/o determinar las coordenadas geográficas de los puntos de captación.\nPara el caso de uso poblacional, esta información lo maneja la EPS. En caso contrario, utilizar el Google Earth y con ayuda de un operario de planta ubicar los puntos de captación y sus respectivas coordenadas."]
[null,"ii. Realizar el análisis de las principales fuentes de agua que son utilizadas por el usuario y delimitar las cuencas potenciales de aporte de dichas fuentes. Asimismo, describir y delimitar (ubicación espacial) la cuenca potencial de aporte hídrico, su uso actual y su tenencia de tierras aspectos físicos legales."]
[null,"Procedimiento"]
[null," i. En este mismo programa (Google Earth) realizar una primera delimitación preliminar de la cuenca de aporte."]
[null," ii. Levantar información en campo para ajustar la delimitación. Para etapa es importante levantar puntos geo referenciados (con un GPS) dentro de la   cuenca y en los límites que sea posible."]
[null,"iii. Con la información levantada en campo, se procede a ajustar la delimitación de la cuenca de aporte a la captación y esta tiene que ser validada en el taller de socialización de resultados."]
[null,"iv. Identificar los ecosistemas de interés hídrico, principal y asociados, en la cuenca de aporte delimitada que corresponden al área de intervención del proyecto."]
[null,"v. Colocar el mapa del área de estudio o llamado también análisis (1), que incluya la identificación de los puntos de captación, la cuenca de aporte de las fuentes identificadas, los ecosistemas de interés hídrico principal y asociado, y el área de influencia."]
[null,"Nota para i, ii y iii: Para lograr una delimitación más exacta se puede utilizar toda la información recogida anteriormente y un mapa a curvas de nivel y la plataforma de ArcGis, como el formato kml; con lo cual se puede delimitar las cuencas de aporte de manera más exacta, siempre y cuando el mapa a curvas de nivel se tenga al detalle que la escala requiera."]
[null,"Adicionalmente"]
[null," - Descripción de la planta de tratamiento (De ser el caso)."]
[null," - Realizar el esquema del sistema hidráulico e indicar su funcionamiento de manera general. Asimismo, identificar  sus principales problemas relacionado en épocas de avenida y estiaje."]
[]
[]
[null,"Nota: \n\nPara poder realizar los procesos metodológicos de caracterización de la función hidrológica de la cuenca en el marco de los servicios ecosistémicos hídricos, se puede recopilar información primaria y secundaria de los diferentes actores involucrados en la cuenca, como por ejemplo de la ALA, AAA, GORE, SENAMHI, GL, ONG, y del usuario del agua del cual se realiza el estudio. Se recomienda un recorrido preliminar para el diagnóstico de la Cuenca. "]

{"sheet":"ESPECIFICACION TECNICA","index":27,"n_rows":31,"n_cols":6,"rows_kept":31,"cut":false,"hidden":false,"merged":[[9,1,17,1],[18,1,22,1],[12,3,14,3],[12,4,14,4],[12,5,12,8],[13,5,13,8],[16,2,17,2],[16,5,16,8],[17,5,17,8],[18,2,22,2],[18,5,18,8],[19,5,19,8],[20,5,20,8],[21,5,21,8],[8,5,8,8],[9,4,10,4],[9,5,10,8],[15,5,15,8],[11,5,11,8],[14,5,14,8],[30,9,31,11],[25,2,25,8],[28,2,28,8],[29,2,29,8],[30,2,30,8],[23,2,23,8],[24,2,24,8],[26,2,26,8],[27,2,27,8],[9,2,15,2],[9,3,10,3],[22,5,22,8]]}
[]
[]
[]
[]
[]
[]
[]
[]
[null,"EJE DE ANÁLISIS","FACTOR DE PRODUCCIÓN DEL SERVICIO ECOSISTÉMICO DE REGULACIÓN HÍDRICA","VARIABLES TÉCNICAS","INFORMES TÉCNICOS, REPORTES QUE SUSTENTEN EL ESTADO DEL ECOSISTEMA DE INTERÉS HÍDRICO","DESCRIPCIÓN DE INFORME TÉCNICO POR PARÁMETRO"]
[null,"ECOSISTEMA","ECOSISTEMA - INFRAESTRUCTURA NATURAL","AGUA","INFORME TÉCNICO SOBRE CANTIDAD Y CALIDAD DEL AGUA, ELABORADO POR EXPERTO TEMÁTICO","El Informe técnico deberá considerar para la calidad del agua los parámetros fisicoquímicos de: Temperatura, pH, conductividad eléctrica y oxígeno disuelto. Para determinar la cantidad del agua se deberá analizar el régimen hídrico (periodos de lluvias y estiaje) y el origen del agua (entrada/salida) - superficial. El indicador para la cuantificación de la cantidad del agua en la situación sin proyecto es el caudal en época de estiaje. El método propuesto para la cuantificación teórica de este indicador se presenta en el presente informe, así como los resultados Sin Proyecto y Con Proyecto. La Ficha propone el método RAS;  si el formulador utiliza otra metodología, deberá responder la estimación de hectáreas recuperadas en ganancia hídrica."]
[]
[null,null,null,"SUELOS","INFORME TÉCNICO SOBRE CARACTERÍSTICAS RELACIONADAS A LA INFILTRACIÓN DE SUELOS, ELABORADO POR EXPERTO TEMÁTICO","Los parámetros técnicos analizados serán: materia orgánica superficial(1), tipo de suelo(2), pendiente(3) y profundidad efectiva del suelo(4) (materia orgánica)."]
[null,null,null,"CARACTERÍSTICAS DEL CLIMA ACTUAL Y FUTURO. IDENTIFICACIÓN DE PELIGROS EN UN CONTEXTO DE CAMBIO CLIMÁTICO","ESTUDIO DEL CLIMA ACTUAL Y TENDENCIAS. IDENTIFICACIÓN DE PELIGROS ASOCIADOS AL CAMBIO CLIMÁTICO","El estudio del clima actual(5): Se realizarán el análisis de los datos históricos de precipitación y las temperaturas máximas y mínimas.\n• Temperatura\nEn este acápite se describen las oscilaciones térmicas que suceden en el ámbito de la cuenca de estudio. \n• Precipitación\nSe analizarán los datos de información pluviométrica registrada en la cuenca, realizando una comparación con los valores normales de precipitación de acuerdo a la estacionalidad.  Las especificaciones sobre el uso de herramientas participativas acerca del estudio del clima actual se muestran en la hoja de detalle."]
[null,null,null,null,null,"Identificación de los Peligros en un Contexto de Cambio Climático (6),(7): En caso de contar con mapas de peligros y/o escenarios climáticos es posible: 1) Identificar los peligros ante los cuales la UP se encuentra expuesto; 2) analizar la exposición de la UP ante cada peligro identificado; e 3) Identificar si la UP es afectada por los cambios futuros del clima (exposición). "]
[null,null,null,null,null,"Análisis de riesgos en contexto de cambio climático en los factores de producción; Los aspectos relacionados a este punto, se evalúan en la hoja correspondiente. \n\nAsimismo, es importante conocer el nivel de riesgo o incertidumbre de los resultados del proyecto, dado que ayudará a conocer el nivel de complejidad de un proyecto de inversión."]
[null,null,null,"    COBERTURA","INFORME TÉCNICO DEL PARÁMETRO COBERTURA VEGETAL E INTRODUCCIÓN DE ESPECIES EXÓTICAS.","Implica el desarrollo de un levantamiento florístico rápido de las formaciones vegetales del ecosistema y la caracterización de sus componentes resaltantes. Este estudio debe contener información general de localización, vistas fotográficas de la zona, información de la presencia o ausencia de especies exóticas, así como la densidad de la cobertura. Las principales metodologías sugeridas son el desarrollo de transectos, anillos censadores, entre otras, apropiadas para el contexto andino."]
[null,null,"MANEJO DE LOS ECOSISTEMAS DE INTERES HIDRICO","PRÁCTICAS DE CONSERVACIÓN DEL AGUA","FICHAS DE DIAGNÓSTICO DE PRÁCTICAS DE CONSERVACIÓN DEL AGUA","Los aspectos relacionados a este punto se evalúan en las fichas de diagnostico que son consideradas en las hojas Excel  correspondiente."]
[null,null,null,"PRÁCTICAS DE CONSERVACIÓN Y MANEJO DE ECOSISTEMAS DE INTERÉS HÍDRICO","FICHAS DE DIAGNÓSTICO DE PRÁCTICAS DE CONSERVACIÓN Y MANEJO DE ECOSISTEMAS DE INTERÉS HÍDRICO","Los aspectos relacionados a este punto se evalúan en las fichas de diagnostico que son consideradas en las hojas Excel  correspondiente."]
[null,"GESTIÓN DEL ECOSISTEMA ANDINO RURAL","GESTIÓN INTEGRADA DEL SERVICIO ECOSISTÉMICO ANDINO RURAL","CAPACIDADES PARA LA GESTIÓN DEL ECOSISTEMA DE INTERÉS HÍDRICO","INFORME DEL ÁREA DE RECURSOS HUMANOS DE LA INSTITUCIÓN ENCARGADA DE LA GESTIÓN DEL ECOSISTEMA DE INTERÉS HÍDRICO","Identificar la Dirección, Gerencia u Oficina encargada de la gestión de los ecosistemas.\n• Identificación de las funciones del área encargada (análisis de competencias y funciones).\n• Relación de trabajadores en el área encargada (nombre y cargo).\n• Identificación de módulos de capacitación para la mejora en la gestión pública. (fecha, cantidad de horas capacitadas, temas, etc.)\n• Identificación de módulos de capacitación para la mejora en la gestión de los ecosistemas relacionados con los servicios ecosistémicos de regulación hídrica. (fecha, cantidad de horas capacitadas, temas, etc.)\n• Identificación del número de trabajadores que se capacitaran, propuestas de fechas de capacitación, propuesta de contenido de los cursos que se dictaran en cada módulo, cantidad de horas capacitadas, posible lugar donde se realizará la capacitación y el cronograma de capacitación semanal."]
[null,null,null,"SENSIBILIZACIÓN AMBIENTAL","INFORME DE RESULTADO DE ENCUESTAS","Encuesta: \nNombre del encuestador \nSexo del encuestado \nEdad del encuestado \nFecha de la encuesta \nPreguntas sobre identificación del ecosistema \nPreguntas concernientes al conocimiento actual del ecosistema \nPreguntas sobre la identificación del problema en el medio ambiente del ecosistema \nPreguntas sobre posibles causas de los problemas en el medio ambiente del ecosistema \nPreguntas sobre posibles soluciones al problema"]
[null,null,null,"INFORMACIÓN AMBIENTAL","INFORME DEL ÁREA TÉCNICA DANDO CUENTA DE LOS ESTUDIOS DISPONIBLES Y APLICADOS","Listado de estudios: \nFecha de realización del estudio \nUbicación geográfica del lugar donde se realizó el estudio"]
[null,null,null,"SEGUIMIENTO Y MONITOREO AMBIENTAL","REPORTE DE ACCIONES DE SEGUIMIENTO Y MONITOREO","Reporte de acciones de seguimiento y monitoreo: \nFechas del monitoreo \nPersonal a cargo del monitoreo \nDebida identificación de las acciones del monitoreo \nResultado del monitoreo \nAnálisis de los resultados"]
[null,null,null,"ORGANIZACIÓN COMUNAL AMBIENTAL","REPORTE DE INSTRUMENTOS DE GESTIÓN EXISTENTES","Listado de instrumentos de gestión existentes:  \nActas de acuerdos firmados por todos los participantes de las reuniones \nImágenes fotográficas de las reuniones"]
[null,null,"(1): El procedimiento para la obtención de la materia orgánica superficial se muestra en la hoja llamada \"Informe de suelos\"."]
[null,null,"(2): Las características relacionadas al tipo de suelo, se muestran en la hoja llamada \"Informe de suelos\"."]
[null,null,"(3): Características relacionadas a la pendiente, se muestra en la hoja llamada \"Informe de suelos\"."]
[null,null,"(4): Para el caso de profundidad efectiva del suelo, se muestran en la hoja titulada \"Informe de suelos\"."]
[null,null,"(5): Los parámetros para el estudio del clima se tomarán a partir de los registros de las estaciones meteorológicas del SENAMHI (bases de datos nacional y/o regional), siendo recomendable periodos de registro de más de 10 años."]
[null,null,"(6): Los peligros asociados al cambio climático se refieren generalmente a sucesos o cambios físicos directos o indirectos relacionados con los cambios en los promedios del clima, variabilidad climática aumentada, y/o la incidencia de eventos extremos intensificados."]
[null,null,"(7): Las herramientas participativas para la identificación de peligros en un contexto de Cambio Climático, se muestran en la hoja correspondiente."]
[null,null,"(8): El modelo de informe de los parámetros de diagnóstico se verá en la hoja correspondiente."]

{"sheet":"INFORME TECNICO CyC DEL AGUA","index":28,"n_rows":23,"n_cols":2,"rows_kept":23,"cut":false,"hidden":false,"merged":[[16,1,16,13],[19,1,19,13],[22,1,23,13],[7,1,7,13],[8,1,9,13],[10,1,10,13],[11,1,11,13],[13,1,13,13]]}
[]
[]
[]
[]
[]
[]
[]
[null,"I. PARÁMETROS TÉCNICOS ANALIZADOS"]
[null,"Propuesta de análisis de valores\n\n• Calidad del agua mediante parámetros fisicoquímicos de:\n\n- Temperatura:  Es una de las características físicas del agua, su unidad de medida es °C, y nos ayuda a relacionar sus valores con los estándares de calidad ambiental para agua\n- PH\n- Conductividad eléctrica\n- Oxígeno disuelto\n\n• Cantidad de agua:\n\n- Régimen hídrico (periodos de lluvia y estiaje):  Consiste en graficar y describir las variaciones de los caudales a nivel mensual y establecer periodos de avenidas y de estiaje. Los caudales aumentan en el periodo de lluvias y tiende a disminuir en el periodo seco. Ejemplo: en la Figura se observa una distribución de los caudales en un año hidrológico; los meses de agosto, setiembre y octubre serian el periodo de avenidas y, los meses de enero, febrero, marzo y abril son de estiaje.\n\n\n\n\n\n\n\n\n\n\n\n\n\n\n\n\n\n- \n\n- Origen del agua o fuente principal: Está referido a identificar y priorizar las principales fuentes para el usuario del agua en estudio. Este proceso se obtiene con reuniones de gabinete y salidas de campo con dicho usuario, que son actores beneficiarios del servicio ecosistémico de regulación hídrica.\n"]
[]
[null,"II. ANÁLISIS DE RESULTADOS"]
[]
[]
[null,"III. CONCLUSIONES"]
[]
[]
[null,"IV. RECOMENDACIONES"]
[]
[]
[null,"V. ANEXOS"]
[]
[]
[null,"NOTA: En caso de no contar con información usar el método RAS y en caso de tener información adjuntar la metodologia aplicada en este informe."]

{"sheet":"INFORME DE COBERTURA VEGETAL","index":29,"n_rows":37,"n_cols":2,"rows_kept":37,"cut":false,"hidden":false,"merged":[[7,19,9,21],[7,1,7,12],[8,1,8,12],[11,1,11,12],[13,1,13,12],[12,1,12,12],[36,1,36,12],[23,1,23,12],[24,1,24,12],[26,1,26,12],[14,1,14,12],[15,1,15,12],[18,1,18,12],[19,1,19,12],[20,1,20,12],[29,1,29,12],[32,1,32,12],[35,1,35,12]]}
[]
[]
[]
[]
[]
[]
[]
[null,"I. OBJETIVO DEL ESTUDIO"]
[null,"- Describir las coberturas (1) de los ecosistemas del ámbito del PIP.\n- Identificar el estado de las coberturas por cada tipo de ecosistema en el ámbito de estudio del PIP."]
[]
[]
[null,"II. METODOLOGÍA"]
[null,"A. MÉTODOS Y PROCEDIMIENTOS\nLa guía de inventario para Flora y Vegetación (2) pone a disposición una serie de metodologías y procedimientos que pueden ser empleados para el proceso solicitado y que deberá considerar:"]
[null,"- La elaboración de un mapa de las coberturas vegetales de los ecosistemas del área del PIP a una escala de 1/20,000.\n- La inclusión de un análisis histórico con imágenes satelitales del ámbito, pudiendo comparar imágenes actuales con otras de 10, 20, o 30 años atrás.\n- La preparación del trabajo de campo: Recojo y sistematización de la información secundaria y el diseño del muestreo a desarrollar.\n- Desarrollo de entrevistas con los actores locales para el análisis de cambios en la cobertura vegetal."]
[null,"B. FUENTES DE INFORMACIÓN"]
[null,"- Definiciones Conceptuales de los Ecosistemas del Perú. MINAM 2018.\n- Mapa de Cobertura Vegetal y su memoria descriptiva.\n- Mapa de Ecosistemas del Perú y su memoria descriptiva."]
[]
[]
[null,"III. PARÁMETROS TÉCNICOS ANALIZADOS"]
[null," Caracterizar las coberturas de la cuenca donde se ubica el usuario"]
[null,"Definición\nCoberturas\n\nPropuesta de análisis de valores\n- Porcentaje de coberturas y áreas (%) \n   Correlacionado con el grado de protección que brinda la vegetación contra el potencial erosivo de la lluvia y grado de estabilidad de la superficie.\n\n- Composición florística (%)\n    Indicador del balance entre los grupos funcionales revela el estado estructural del ecosistema (incluye presencia de plantas invasoras).\n\n- Riqueza de especies (#especies/área)\n   Refiere al número de especies perennes por grupo funcional (gramíneas, hierbas y arbustos) que existen en el área y es un indicador del grado de estabilidad y resiliencia del ecosistema."]
[]
[]
[null,"IV. ANÁLISIS DE RESULTADOS"]
[null,"En esta etapa, luego de caracterizar las coberturas vegetales de la cuenca, a nivel de gabinete y campo, se procederá a identificar las áreas que han sido degradadas, indicando extensión, así como las causas que generan/han generado dicha degradación."]
[]
[null,"V. CONCLUSIONES"]
[]
[]
[null,"VI. RECOMENDACIONES"]
[]
[]
[null,"VII. ANEXOS"]
[]
[]
[null,"[1] Coberturas: Entiéndase como cobertura vegetal en ecosistemas terrestres y superficie en ecosistemas acuáticos."]
[null,"[2] Guía de Inventario de la Flora y Vegetación, aprobado por Resolución Ministerial N° 59-2015-MINAM. "]

{"sheet":"INFORME DE SUELOS","index":30,"n_rows":45,"n_cols":2,"rows_kept":45,"cut":false,"hidden":false,"merged":[[21,1,21,12],[22,1,22,12],[23,1,23,12],[14,1,14,12],[15,1,15,12],[18,1,18,12],[19,1,19,12],[20,1,20,12],[7,1,7,12],[8,1,8,12],[11,1,11,12],[12,1,12,12],[13,1,13,12],[28,1,28,12],[29,1,29,12],[30,1,30,12],[24,1,25,12],[26,1,27,12],[40,1,40,12],[43,1,43,12],[44,1,44,12],[33,1,33,12],[34,1,34,12],[37,1,37,12]]}
[]
[]
[]
[]
[]
[]
[]
[null,"I. OBJETIVO DEL ESTUDIO"]
[null,"Realizar la descripción biofísica del factor suelo."]
[]
[]
[null,"II. METODOLOGÍA"]
[null,"A. MÉTODOS Y PROCEDIMIENTOS"]
[null,"El formulador deberá indicar los métodos y procedimientos a realizar para la elaboración del proyecto."]
[null,"B. FUENTES DE INFORMACIÓN"]
[null,"El formulador deberá describir las fuentes de información primaria y secundaria a ser utilizadas.  "]
[]
[]
[null,"III. PARÁMETROS TÉCNICOS ANALIZADOS"]
[null,"A. Materia Orgánica Superficial"]
[null,"Definición\nLa materia orgánica acumulada en la forma de hojarasca, el color del suelo y la existencia de estructura son indicadores de la cantidad de materia orgánica presente y del potencial del sitio para proveer nutrientes al ecosistema así como brindar condiciones adecuadas para el desarrollo de la vegetación y el funcionamiento del sistema hidrológico. (Guía complementaria para la compensación ambiental. Ecosistemas altoandinos. MINAM, 2016).\n\nNota importante: Las áreas con muy bajo contenido de materia orgánica tienen poca capacidad para retener agua y liberar nutrientes.\n\nPropuesta de análisis de valores\nMuestras representativas o alícuotas de suelo (01 kg. para suelo mineral y 1.5 Kg. para suelo orgánico) son obtenidas del área de evaluación y remitidas al laboratorio de suelos para el análisis respectivo. Cada alícuota está compuesta por una muestra combinada de cinco submuestras (01 kg)  tomadas sistemáticamente, cada 20 m. a lo largo de una transecta de 100 m. Las submuestras son porciones de suelo debajo del hoyo hecho con una pala recta formando un cubo que corresponde al ancho y largo de la pala (aprox. 20 cm x 20 cm). La muestra o alícuota se guarda en bolsas dobles de plástico y se etiquetan colocando la etiqueta entre las bolsas para evitar su deterioro y la pérdida de la identidad de la muestra."]
[null,"B. Tipo de suelo\nPara este tipo de estudios y su escala, para la zona andina, se recomienda clasificar a esta variable como: 1. Suelo mineral (en unidades de cobertura vegetal: pajonal de puna, césped de puna, jalca, tolar y matorral andino) y 2. Suelo orgánico (en unidades de cobertura vegetal: bofedal, páramo, humedales andinos)"]
[null,"Definición\n- Material no consolidado compuesto por partículas inorgánicas, materia orgánica, agua, aire y organismos, que comprende desde la capa superior de la superficie terrestre hasta diferentes niveles de profundidad.\n- Los suelos de las zonas altoandinas son suelos ácidos, con bajas concentraciones de fósforo y potasio, con contenidos variables de materia orgánica, con baja cantidad de cationes intercambiables y con problemas de fertilidad (Alegría, 2010). Es por ello que requieren ser fertilizados. \n- Factores que deben ser considerados para realizar la fertilización son el agua del suelo pues la respuesta de la fertilización está directamente relacionada con la disponibilidad de agua en el suelo, ecología de plantas, momento de fertilización y toxicidad, para lo cual se deben administrar dosis en base a los requerimientos del cultivo y análisis químico del suelo. (Herbel, 1983).  \n- Las enmiendas ayudan a la restauración de los atributos perdidos del suelo, por lo cual se puede mejorar la germinación y el establecimiento de las plantas nativas. Los suelos andinos tienden a acidificarse más cuando las condiciones abióticas son alteradas por exceso de lavado y compactación de suelo. En este sentido, el uso de cal amortigua el pH de los suelos ácidos, mejorando la calidad de materia orgánica, la capacidad del suelo para retener nutrientes y la humedad; de esta manera, se obtendrá una mejor disponibilidad de nutrientes (Truog, 1951).\n- Los pastizales naturales generalmente tienen una adecuada productividad a un pH de 6, por otro lado el establecimiento de la planta se puede ver afectada negativamente si el pH es inferior a 5.5 y la toxicidad de metales pesados restringe el crecimiento de las raíces. Con el encalado se puede restablecer el pH a valores de 6 o más.\n\nPropuesta de análisis de valores\nEl procedimiento será en función al análisis del suelo, características físico químicas del suelo, comunidad vegetal original, etc."]
[null,"C. Pendiente"]
[null,"Definición\nSe relaciona principalmente con la erosión hídrica, mientras más pronunciada, mayor la severidad de la erosión. La erosión se va incrementando a medida que aumenta la pendiente del terreno ya que también lo hacen la cantidad y la energía de la escorrentía superficial.\nLas pérdidas de suelo por erosión hídrica crecen al aumentar la inclinación y la longitud de las laderas como consecuencia del incremento de la velocidad y volumen de la escorrentía superficial, y sus efectos se hacen sentir mucho más fuerte en las partes inferiores de las laderas.\n\n\n\n\n\n\n\n\n\nSe recomienda no realizar intervenciones en las zonas denominadas como protección.\n\n                                                                                                        Rangos de pendientes corta y larga"]
[]
[null,"Propuesta de análisis de valores\n- Utilizando GPS, ubicarse en un punto del terreno del cual se desea determinar la pendiente.\n- Plantar una estaca, que vendría a ser el punto A.\n- De la base de esta estaca que coincide con la superficie superior del terreno, tirar horizontalmente un cordel hasta una longitud de 100 cm. que debe nivelarse en este sentido utilizando un nivel cuyo extremo seria el punto B.\n- A esta altura plantar otra estaca la que debe estar totalmente en forma vertical que marcaría el punto C en la parte inferior de la superficie del terreno; formándose un triángulo rectángulo.\n- Utilizando la wincha, medir la altura desde donde alcanza los 100 cm horizontales hasta la superficie inferior del terreno.\n- Se sabe que la pendiente es igual a la tangente y esta es igual al cateto opuesto entre el cateto adyacente y para expresarlo en porcentaje se multiplica por 100; la fórmula matemática es la siguiente: m = tg = BC/AB x 100.\n\nEl siguiente grafico ilustra el procedimiento:"]
[]
[null,"D. Profundidad efectiva del suelo"]
[null,"Definición\nEs el espesor de las capas del suelo en donde las raíces de las plantas pueden penetrar fácilmente en busca de agua y nutrientes. Su límite inferior está dado por capas de arcillas muy densas, capas extremadamente duras, materiales fragmentarios (gravas, piedras o rocas) o napa freática permanente, que actúa como limitantes del desarrollo normal de las plantas. (Reglamento de clasificación de tierras. MINAGRI, 2009).\n\nEn el siguiente cuadro se muestra la calificación (clases) que se da al suelo de acuerdo a su profundidad efectiva:\n\n"]
[null,"Procedimiento\nReglamento para la Ejecución de Levantamiento de Suelos (Decreto Supremo N° 013-2010-AG)"]
[]
[]
[null,"IV. ANÁLISIS DE RESULTADOS"]
[null,"El análisis de los resultados está en función a los parámetros indicados en las variables señaladas en la sección III del presente informe."]
[]
[]
[null,"V. CONCLUSIONES"]
[]
[]
[null,"VI. RECOMENDACIONES"]
[]
[]
[null,"VII. ANEXOS"]
[null,"\nLos mapas que se requieran para la elaboración del proyecto deben ser impresos para su presentación en una escala adecuada que permita una correcta visualización.\n- ANÁLISIS DEL LABORATORIO \n- PANEL FOTOGRÁFICO"]

{"sheet":"HERRAMIENTAS CLIMA Y PELI","index":31,"n_rows":13,"n_cols":2,"rows_kept":13,"cut":false,"hidden":false,"merged":[[7,1,7,10],[8,1,8,10],[11,1,11,10],[12,1,12,10],[7,11,7,12],[9,1,9,10]]}
[]
[]
[]
[]
[]
[]
[]
[null,"CLIMA"]
[null,"Utilizar la información del SENAMHI de los siguientes opciones de la página web Idesep - Senamhi:\na. Evento El Niño: extraer información de precipitaciones relacionadas a:\n     * Niño 82-83, extraer información sobre intensidad de rango de precipitaciones.\n     * Niño 97-98, extraer información sobre intensidad de rango de precipitaciones.\n     * Niño 2017, extraer información sobre intensidad de rango de precipitaciones.\nb. Caracterización: focalizarse en la información de Temperatura mínima y máximas expresada en rangos actual, que representa el promedio de los últimos 30 años. \nc. Cambio Climático: extraer la información referida a:\n     * Proyecciones 2030 anual, extraer información referente a: precipitación anual 2030, Temperatura mínima anual 2030, Temperatura máxima anual 2030.\n      * Variación 2030 anual, extraer información referente a: precipitación variación anual 2030, Temperatura mínima variación anual 2030, Temperatura máxima variación anual 2030.\n\nLa información debe ser axtraida del siguiente link:\n\nhttp://idesep.senamhi.gob.pe/geovisoridesep/go?accion=06.03.001.03.001.513.0000.00.00"]
[]
[]
[null,"HERRAMIENTAS PARTICIPATIVAS: PELIGROS"]
[null,"Las herramientas participativas publicadas por el MEF en el año 2015 son aquellas que trabajan directamente con la población involucrada mediante talleres participativos. La información primaria debe ser complementada con información técnica, así como con información de fuentes secundarias. Estas herramientas son de utilidad puesto que determinan a escala local: los peligros, la exposición y la vulnerabilidad de la Unidad Productora de servicios ecosistémicos hídricos.                                       \n\nHerramientas participativas en los proyectos de inversión para la identificación de peligros asociados al cambio climático                                                                                  \n\n\n"]

{"sheet":"ANALISIS DE RIESGO","index":32,"n_rows":22,"n_cols":2,"rows_kept":22,"cut":false,"hidden":false,"merged":[[7,1,7,10],[8,1,8,10],[9,1,9,10],[10,1,10,10],[11,1,11,10],[21,1,21,10],[22,1,22,10],[12,1,12,10],[13,1,13,10],[14,1,14,10],[15,1,15,10],[16,1,16,10],[17,1,17,10],[18,1,18,10],[19,1,19,10],[20,1,20,10]]}
[]
[]
[]
[]
[]
[]
[]
[null,"Análisis de riesgos en el contexto de cambio climático en los factores de producción"]
[null,"En este informe se aplica una metodología cualitativa para el estudio de los factores de producción considerando la escasa información para el análisis de riesgos en un contexto de cambio climático, siendo aplicable a los proyectos cuya inversión sea menor o igual a las 750 UIT. \n\nEn ese sentido, los factores que se incluyen en el análisis de riesgos de los factores de producción del servicio ecosistémico de regulación hídrica son:\n"]
[null,"En este estudio, se identificarán los peligros de origen climático que impactan, generan o pueden generar riesgos actuales/potenciales en las funciones de los factores de producción que inciden en el servicio ecosistémico de regulación hídrica: cobertura vegetal, suelos y agua, conforme se observa en el gráfico siguiente:"]
[]
[null,"A. Análisis de riesgos del componente del factor suelo"]
[null,"\nEste factor de producción tiene un rol importante en el ciclo de regulación del agua en tanto determina las características de la infiltración a nivel del perfil del suelo, propiedad del suelo que depende de la textura, es decir de la proporción del tipo de minerales de arcilla, limo y arena que dieron origen a las diferentes texturas del suelo. El cambio climático afecta de manera indirecta la tasa de infiltración del suelo, en la medida que una mayor ocurrencia de precipitaciones intensas o incremento en el promedio de precipitaciones pueden causar mayor erosión de los suelos, y este proceso, a su vez, altera la profundidad del perfil de suelo, lo cual reduce la tasa de infiltración. "]
[null,"Riesgo potencial en la tasa de infiltración del suelo ante la mayor recurrencia de lluvias intensas"]
[]
[null,"B. Análisis de riesgos componente cobertura vegetal "]
[null,"\nLa cobertura vegetal es uno de los principales factores de producción del servicio ecosistémico de regulación hídrica ya que, al interceptar las precipitaciones, mejora los procesos de infiltración del agua en los suelos, reduciendo la escorrentía superficial del agua y la generación de procesos erosivos, facilitando a su vez en una mayor humedad del suelo y reducción de los procesos de desertificación. En un contexto de cambio climático, el rol de intercepción de la cobertura vegetal se ve afectada por el cambio en los patrones de lluvias, tales como la estacionalidad, intensidad, y frecuencia, que reducen la capacidad de intercepción del agua de lluvias.   \n\nEl objetivo del siguiente análisis es determinar el riesgo potencial de los efectos del cambio climático en las funciones que cumple la cobertura vegetal en el servicio de regulación hídrica, considerando el tipo de asociación vegetal (bofedales-césped, bosques-matorral y pajonales), frente a la reducción de precipitaciones. A manera de ejemplo se presenta el análisis de riesgo de la cobertura por asociación vegetal frente a este peligro. "]
[null,"Riesgo potencial en la tasa de intercepción de la cobertura vegetal ante la reducción de precipitaciones (sequías)"]
[]
[null,"C. Análisis de riesgos en el componente del factor agua"]
[null,"\nTiene como objetivo identificar las condiciones de riesgo en la reducción de las tasas de almacenamiento de agua ante las variaciones en el clima, principalmente de los cambios en el patrón de lluvias, lo que tiene efectos directos, no sólo en los servicios ecosistémicos de regulación hídrica actual y futuros (de contar con información de escenarios climáticos).\n\nEl volumen de agua almacenada en una cuenca corresponde al agua de lluvia que cae directamente al suelo y aquella que es interceptada por la cobertura vegetal (tasa de intercepción) en ambos casos el agua se infiltra (tasa de infiltración) y es conducida internamente o superficialmente hacia los cuerpos de agua subterráneos y/o superficiales respectivamente (tasa de almacenamiento). \n\nEl cambio climático afecta este proceso, alterando la tasa de almacenamiento superficial y subterráneo, debido a la relación directa de la tasa de intercepción y la tasa de infiltración con los cambios en el régimen de precipitaciones convirtiéndose en un factor de riesgo para la capacidad de almacenamiento de las cuencas. \n\nEn este sentido, a fin de ejemplificar cómo los peligros asociados al cambio climático inciden en la tasa de almacenamiento de los cuerpos de agua, se muestra a continuación, la relación de riesgo potencial entre la reducción de precipitación (sequías) y la capacidad de almacenamiento superficial en lagos, lagunas y cochas."]
[null,"Riesgo potencial en la tasa de almacenamiento de agua superficial ante la reducción de precipitaciones (sequías)"]

{"sheet":"MATRIZ DE COSTO ESPECIALISTA","index":33,"n_rows":25,"n_cols":9,"rows_kept":25,"cut":false,"hidden":false,"merged":[[26,1,27,8],[4,1,5,1],[7,1,10,1],[11,1,15,1],[16,1,20,1],[21,1,24,1],[1,1,1,8],[2,1,3,1],[2,2,3,2],[2,3,3,3],[2,4,2,5],[2,6,3,6],[2,7,3,7],[2,8,3,8]]}
[]
[null,"MATRIZ DE LOS ESPECIALISTAS PARA CALCULAR SU COSTO"]
[null,"PRODUCTO POR MEDIO FUNDAMENTAL","DESCRIPCION DE ACCIONES","ESPECIALISTA","UNIDAD DE PRODUCCIÓN",null,"TIEMPO ESTIMADO","COSTO UNITARIO EN SOLES","COSTOS SUB TOTAL EN SOLES"]
[null,null,null,null,"UM","META"]
[null,"HECTÁREAS DE COBERTURA VEGETAL INCREMENTADAS DEL ECOSISTEMA PRINCIPAL",{"$f":"+'8.ANALISIS TÉCNICO'!D26","v":"REVEGETACIÓN CON ESPECIES NATIVAS"},"Especialista de Cobertura Vegetal",{"$f":"+IF(C5=\"\",\"\",\"HA\")","v":"HA"},null,null,null,{"$f":"+G5*H5","v":0}]
[null,null,{"$f":"+'8.ANALISIS TÉCNICO'!D27","v":"INSTALACIÓN DE CERCOS EXCLUIDORES"},"Especialista de Cobertura Vegetal",{"$f":"+IF(C6=\"\",\"\",\"ML\")","v":"ML"},null,null,null,{"$f":"+G6*H6","v":0}]
[null,"HECTÁREAS DE ESTRUCTURA DE LA TURBA RECUPERADA DEL ECOSISTEMA PRINCIPAL",{"$f":"+'8.ANALISIS TÉCNICO'!D29","v":"REVEGETACIÓN CON ESPECIES NATIVAS"},"Especialista de Cobertura Vegetal",{"$f":"+IF(C7=\"\",\"\",\"HA\")","v":"HA"},null,null,null,0]
[null,"HECTÁREAS DE COBERTURA VEGETAL INCREMENTADAS DE LOS ECOSISTEMAS ASOCIADOS",{"$f":"+'8.ANALISIS TÉCNICO'!D31","v":"REFORESTACIÓN CON ESPECIES NATIVAS"},"Especialista de Cobertura Vegetal",{"$f":"+IF(C8=\"\",\"\",\"HA\")","v":"HA"},null,null,null,0]
[null,null,{"$f":"+'8.ANALISIS TÉCNICO'!D32","v":"REVEGETACIÓN CON ESPECIES NATIVAS"},"Especialista de Cobertura Vegetal","HA",null,null,null,0]
[null,null,{"$f":"+'8.ANALISIS TÉCNICO'!D33","v":"INSTALACIÓN DE CERCOS EXCLUIDORES"},"Especialista de Cobertura Vegetal",{"$f":"+IF(C10=\"\",\"\",\"ML\")","v":"ML"},null,null,null,0]
[null,null,{"$f":"+'8.ANALISIS TÉCNICO'!D35","v":"ENRIQUECIMIENTO DE SUELOS"},"Especialista en Suelos","HA",null,null,null,0]
[null,"NÚMERO DE MEDIDAS DE ADAPTACIÓN AL RÉGIMEN DE PRECIPITACIONES DE LOS ECOSISTEMAS ASOCIADOS",{"$f":"+'8.ANALISIS TÉCNICO'!D37","v":"REPARACIÓN DEL CANAL AMUNADOR"},"Especialista en hidrología ","HA",null,null,null,{"$f":"+G12*H12","v":0}]
[null,null,{"$f":"+'8.ANALISIS TÉCNICO'!D38","v":"REPARACIÓN DEL CANAL DE MAMANTEO"},"Especialista en hidrología ",{"$f":"+IF(C13=\"\",\"\",\"ML\")","v":"ML"},null,null,null,0]
[null,null,{"$f":"+'8.ANALISIS TÉCNICO'!D39","v":"CONSTRUCCIÓN DE ZANJAS DE INFILTRACIÓN"},"Especialista en hidrología ",{"$f":"+IF(C14=\"\",\"\",\"ML\")","v":"ML"},null,null,null,0]
[null,null,{"$f":"+'8.ANALISIS TÉCNICO'!D40","v":"INSTALACIÓN DE QOCHAS"},"Especialista en hidrología ",{"$f":"+IF(C15=\"\",\"\",\"M2\")","v":"M2"},null,null,null,0]
[null,null,{"$f":"+'8.ANALISIS TÉCNICO'!D41","v":"CONSTRUCCIÓN DE TERRAZAS DE FORMACIÓN DE SUELOS"},"Especialista en Suelos","HA",null,null,null,0]
[null,"POBLADORES CON ADECUADAS CAPACIDADES EN PRÁCTICAS DE MANEJO DE LOS ECOSISTEMAS DE INTERÉS HÍDRICO",{"$f":"+'8.ANALISIS TÉCNICO'!D43","v":"CAPACITACIÓN EN GESTIÓN INTEGRADA DE RECURSOS HÍDRICOS CON ENFOQUE DE CUENCA"},"Especialista en proyectos",{"$f":"+IF(C17=\"\",\"\",\"EVENTO\")","v":"EVENTO"},null,null,null,0]
[null,null,{"$f":"+'8.ANALISIS TÉCNICO'!D44","v":"ASISTENCIA TÉCNICA EN EL MANEJO DE ECOSISTEMAS DE INTERÉS HÍDRICO"},"Especialista en proyectos",{"$f":"+IF(C18=\"\",\"\",\"EVENTO\")","v":"EVENTO"},null,null,null,0]
[null,null,{"$f":"+'8.ANALISIS TÉCNICO'!D45","v":"CAPACITACIÓN EN BUENAS PRÁCTICAS PARA LA ADAPTACIÓN AL CAMBIO CLIMÁTICO Y GESTIÓN DE RIESGOS"},"Especialista en proyectos",{"$f":"+IF(C19=\"\",\"\",\"TALLER\")","v":"TALLER"},null,null,null,0]
[null,null,{"$f":"+'8.ANALISIS TÉCNICO'!D46","v":"SENSIBILIZACIÓN RELACIONADA A LA RECUPERACIÓN DEL SERVICIO ECOSISTÉMICO DE REGULACIÓN HÍDRICA"},"Especialista en proyectos",{"$f":"+IF(C20=\"\",\"\",\"TALLER\")","v":"TALLER"},null,null,null,0]
[null,null,{"$f":"+'8.ANALISIS TÉCNICO'!D47","v":"INTERCAMBIO DE EXPERIENCIAS RELACIONADAS A LA RECUPERACIÓN DEL SERVICIO ECOSISTÉMICO DE REGULACIÓN HÍDRICA"},"Especialista en proyectos",{"$f":"+IF(C21=\"\",\"\",\"EVENTO\")","v":"EVENTO"},null,null,null,0]
[null,"N° DE ÁREAS U ÓRGANOS ENCARGADOS DE LA GESTIÓN DEL ECOSISTEMA DE INTERÉS HÍDRICO CON ADECUADAS CAPACIDADES EN GESTIÓN DEL ECOSISTEMA",{"$f":"+'8.ANALISIS TÉCNICO'!D49","v":"CAPACITACIÓN A FUNCIONARIOS PÚBLICOS SOBRE LA GESTIÓN INTEGRADA DEL RECURSO HÍDRICO CON ENFOQUE DE CUENCA"},"Especialista en proyectos",{"$f":"+IF(C22=\"\",\"\",\"TALLER\")","v":"TALLER"},null,null,null,0]
[null,null,{"$f":"+'8.ANALISIS TÉCNICO'!D50","v":"CAPACITACIÓN A FUNCIONARIOS PÚBLICOS SOBRE LAS MEDIDAS DE ADAPTACIÓN EN UN CONTEXTO DE CAMBIO CLIMÁTICO EN LA GESTIÓN INTEGRADA DE LOS RECURSOS HÍDRICOS"},"Especialista en proyectos",{"$f":"+IF(C23=\"\",\"\",\"TALLER\")","v":"TALLER"},null,null,null,0]
[null,null,{"$f":"+'8.ANALISIS TÉCNICO'!D51","v":"DESARROLLO DE CAPACIDADES PARA EL MONITOREO Y SEGUIMIENTO DE LOS ECOSISTEMAS DE INTERÉS HÍDRICO Y EL SERVICIO ECOSISTÉMICO DE REGULACIÓN HÍDRICA"},"Especialista en proyectos",{"$f":"+IF(C24=\"\",\"\",\"TALLER\")","v":"TALLER"},null,null,null,0]
[null,null,{"$f":"+'8.ANALISIS TÉCNICO'!D52","v":"INTERCAMBIO DE EXPERIENCIAS SOBRE LA GESTIÓN INTEGRADA DEL RECURSO HÍDRICO CON ENFOQUE DE CUENCA"},"Especialista en proyectos",{"$f":"+IF(C25=\"\",\"\",\"EVENTO\")","v":"EVENTO"},null,null,null,0]

{"sheet":"MANEJO LOS ECOSIST. DE INTE.","index":34,"n_rows":138,"n_cols":41,"rows_kept":138,"cut":false,"hidden":false,"merged":[[8,1,8,20],[9,1,9,4],[9,5,9,14],[10,1,11,4],[10,5,10,8],[10,9,10,12],[10,13,10,16],[10,17,10,20],[9,15,9,20],[13,1,14,4],[13,5,13,8],[13,9,13,12],[13,13,13,20],[14,5,14,8],[14,9,14,12],[14,13,14,16],[14,17,14,20],[11,5,11,8],[11,9,11,12],[11,13,11,16],[11,17,11,20],[12,1,12,4],[12,5,12,20],[18,1,18,4],[18,5,18,20],[19,1,19,4],[19,5,19,20],[20,1,20,4],[20,5,20,12],[20,13,20,20],[15,1,15,4],[15,5,15,20],[16,1,16,4],[16,5,16,20],[17,1,17,4],[17,5,17,20],[21,1,21,4],[21,5,21,20],[22,1,22,4],[22,5,22,20],[23,1,26,1],[23,2,23,4],[23,5,23,8],[23,9,23,12],[23,13,23,16],[23,17,23,20],[24,2,24,4],[24,5,24,8],[24,9,24,12],[24,13,24,16],[24,17,24,20],[25,2,25,4],[25,5,25,8],[25,9,25,12],[25,13,25,16],[25,17,25,20],[28,1,28,4],[28,5,28,20],[31,1,31,20],[32,1,32,4],[32,5,32,14],[26,2,26,4],[26,5,26,8],[26,9,26,12],[26,13,26,16],[26,17,26,20],[27,1,27,4],[27,5,27,20],[32,15,32,20],[33,1,34,4],[33,5,33,8],[33,9,33,12],[33,13,33,16],[33,17,33,20],[34,5,34,8],[34,9,34,12],[34,13,34,16],[34,17,34,20],[38,1,38,4],[38,5,38,20],[39,1,39,4],[39,5,39,20],[40,1,40,4],[40,5,40,20],[35,1,35,4],[35,5,35,20],[36,1,37,4],[36,5,36,8],[36,9,36,12],[36,13,36,20],[37,5,37,8],[37,9,37,12],[37,13,37,16],[37,17,37,20],[41,1,41,4],[41,5,41,20],[42,1,42,4],[42,5,42,20],[43,1,46,1],[43,2,43,4],[43,5,43,8],[43,9,43,12],[43,13,43,16],[43,17,43,20],[44,2,44,4],[44,5,44,8],[44,9,44,12],[44,13,44,16],[44,17,44,20],[45,2,45,4],[45,5,45,8],[45,9,45,12],[45,13,45,16],[45,17,45,20],[48,1,48,4],[48,5,48,20],[51,1,51,20],[52,1,52,4],[52,5,52,14],[46,2,46,4],[46,5,46,8],[46,9,46,12],[46,13,46,16],[46,17,46,20],[47,1,47,4],[47,5,47,20],[52,15,52,20],[53,1,54,4],[53,5,53,8],[53,9,53,12],[53,13,53,16],[53,17,53,20],[54,5,54,8],[54,9,54,12],[54,13,54,16],[54,17,54,20],[55,1,55,4],[55,5,55,20],[56,1,57,4],[56,5,56,8],[56,9,56,12],[56,13,56,20],[57,5,57,8],[57,9,57,12],[57,13,57,16],[57,17,57,20],[61,1,61,4],[61,5,61,20],[62,1,62,4],[62,5,62,20],[63,1,63,4],[63,5,63,20],[58,1,58,4],[58,5,58,20],[59,1,59,4],[59,5,59,20],[60,1,60,4],[60,5,60,20],[65,17,65,20],[66,2,66,4],[66,5,66,8],[66,9,66,12],[66,13,66,16],[66,17,66,20],[64,1,67,1],[64,2,64,4],[64,5,64,8],[64,9,64,12],[64,13,64,16],[64,17,64,20],[65,2,65,4],[65,5,65,8],[65,9,65,12],[65,13,65,16],[69,1,69,4],[69,5,69,20],[82,1,82,20],[83,1,83,4],[83,5,83,14],[67,2,67,4],[67,5,67,8],[67,9,67,12],[67,13,67,16],[67,17,67,20],[68,1,68,4],[68,5,68,20],[83,15,83,20],[84,1,85,4],[84,5,84,8],[84,9,84,12],[84,13,84,16],[84,17,84,20],[85,5,85,8],[85,9,85,12],[85,13,85,16],[85,17,85,20],[86,1,86,4],[86,5,86,20],[87,1,88,4],[87,5,87,8],[87,9,87,12],[87,13,87,20],[88,5,88,8],[88,9,88,12],[88,13,88,16],[88,17,88,20],[92,1,92,4],[92,5,92,20],[93,1,93,4],[93,5,93,12],[93,13,93,20],[94,1,94,4],[94,5,94,20],[89,1,89,4],[89,5,89,20],[90,1,90,4],[90,5,90,20],[91,1,91,4],[91,5,91,20],[95,1,95,4],[95,5,95,20],[96,1,99,1],[96,2,96,4],[96,5,96,8],[96,9,96,12],[96,13,96,16],[96,17,96,20],[97,2,97,4],[97,5,97,8],[101,1,101,4],[101,5,101,20],[99,2,99,4],[99,5,99,8],[99,9,99,12],[99,13,99,16],[99,17,99,20],[100,1,100,4],[97,9,97,12],[97,13,97,16],[97,17,97,20],[98,2,98,4],[98,5,98,8],[98,9,98,12],[98,13,98,16],[98,17,98,20],[100,5,100,20],[120,9,120,12],[120,13,120,16],[120,17,120,20],[113,1,113,4],[114,1,115,4],[113,5,113,20],[114,5,114,12],[114,13,115,20],[115,5,115,12],[137,1,137,4],[137,5,137,20],[135,1,135,4],[127,1,127,4],[130,1,130,4],[131,1,132,4],[126,1,126,20],[127,5,127,14],[127,15,127,20],[128,1,129,4],[128,5,128,8],[128,9,128,12],[128,13,128,16],[133,1,133,4],[133,5,133,20],[134,5,134,20],[135,5,135,20],[136,1,136,4],[136,5,136,20],[130,5,130,20],[131,5,131,20],[132,5,132,20],[134,1,134,4],[122,2,122,4],[122,5,122,8],[122,9,122,12],[122,13,122,16],[122,17,122,20],[119,1,122,1],[116,1,116,4],[116,5,116,20],[117,1,117,4],[117,5,117,20],[118,1,118,4],[118,5,118,20],[119,2,119,4],[119,5,119,8],[121,2,121,4],[121,5,121,8],[121,9,121,12],[121,13,121,16],[121,17,121,20],[119,9,119,12],[119,13,119,16],[119,17,119,20],[120,2,120,4],[120,5,120,8],[108,1,108,20],[109,1,109,20],[110,1,110,4],[110,5,110,14],[110,15,110,20],[111,1,112,4],[111,5,111,8],[111,9,111,12],[111,13,111,16],[111,17,111,20],[112,5,112,8],[112,9,112,12],[112,13,112,16],[112,17,112,20],[123,1,123,4],[123,5,123,20],[124,1,124,4],[124,5,124,20],[128,17,128,20],[129,5,129,8],[129,9,129,12],[129,13,129,16],[129,17,129,20]]}
[]
[]
[]
[]
[]
[]
[]
[]
[null,"Ficha Técnica para el diagnostico de Practicas de Conservación de Agua: Qochas"]
[null,"Qochas",null,null,null,null,null,null,null,null,null,null,null,null,null,"Fecha"]
[null,"Ubicación de las Qochas",null,null,null,"Norte",null,null,null,"Este",null,null,null,"Zona",null,null,null,"Datum"]
[]
[null,"Ubicación de las Qochas (describir)",null,null,null,"-------------------------------------"]
[null,"Características físicas de la Qochas",null,null,null,"Área superficial (m2)",null,null,null,"Pendiente",null,null,null,"Profundidad "]
[null,null,null,null,null,null,null,null,null,null,null,null,null,"Ancho:",null,null,null,"Alto:"]
[null,"Tipo de ecosistema"]
[null,"Tipo de vegetación "]
[null,"Identificación de la Red Hidráulica"]
[null,"Tipo de construcción"]
[null,"Suelos disturbados (describir)"]
[null,"Existencia de Dique",null,null,null,"Si _____",null,null,null,null,null,null,null,"No __________"]
[null,"Estado actual del Dique"]
[null,"Obras de rehabilitación existentes \n(describir)"]
[null,"Aspectos de análisis","Accesibilidad",null,null,"0= Bote, helicóptero,\navión",null,null,null,"1= Recorrido largo en vehículo o a pie en vía no demarcada",null,null,null,"2= En vehículo seguido　de distancia corta a pie(<500m)",null,null,null,"3= Adyacente a áreas pobladas, corta distancia en vehículo o corta distancia a pie."]
[null,null,"Potencial de colapso",null,null,"0= Ninguno",null,null,null,"1=Cimentaciones en buenas condiciones, construcciones a nivel del suelo",null,null,null,"2=Cimentaciones deterioradas, construcciones de poca elevación",null,null,null,"3=Cimentaciones deterioradas, caída de escombros construcciones elevadas"]
[null,null,"Condiciones de estructura",null,null,"0=Estructuras removidas y sitio rehabilitado",null,null,null,"1=Estructuras removidas y sitio no  rehabilitado",null,null,null,"2=Estructuras parcialmente removidas",null,null,null,"3=Estructuras permanecen en el sitio"]
[null,null,"Otras consideraciones"]
[null,"Fotos y diagramas \n(use hojas adicionales si es necesario)"]
[null,"Comentarios"]
[]
[]
[null,"Ficha Técnica para el diagnostico de Practicas de Conservación de Agua: Mamanteo"]
[null,"Mamanteo",null,null,null,null,null,null,null,null,null,null,null,null,null,"Fecha"]
[null,"Ubicación del Mamanteo (describir)",null,null,null,"Norte",null,null,null,"Este",null,null,null,"Zona",null,null,null,"Datum"]
[]
[null,"Ubicación del Mamanteo (describir)",null,null,null,"-------------------------------------"]
[null,"Características físicas del Mamanteo",null,null,null,"Área superficial (m2)",null,null,null,"Pendiente",null,null,null,"Profundidad "]
[null,null,null,null,null,null,null,null,null,null,null,null,null,"Ancho:",null,null,null,"Alto:"]
[null,"Tipo de ecosistema"]
[null,"Tipo de vegetación "]
[null,"Tipo de construcción"]
[null,"Suelos disturbados (describir)"]
[null,"Obras de rehabilitación existentes (describir)"]
[null,"Aspectos de análisis","Accesibilidad",null,null,"0= Bote, helicóptero,\navión",null,null,null,"1= Recorrido largo en vehículo o a pie en vía no demarcada",null,null,null,"2= En vehículo seguido　de distancia corta a pie(<500m)",null,null,null,"3= Adyacente a áreas pobladas, corta distancia en vehículo o corta distancia a pie."]
[null,null,"Potencial de colapso",null,null,"0= Ninguno",null,null,null,"1=Cimentaciones en buenas condiciones, construcciones a nivel del suelo",null,null,null,"2=Cimentaciones deterioradas, construcciones de poca elevación",null,null,null,"3=Cimentaciones deterioradas, caída de escombros construcciones elevadas"]
[null,null,"Condiciones de estructura",null,null,"0=Estructuras removidas y sitio rehabilitado",null,null,null,"1=Estructuras removidas y sitio no  rehabilitado",null,null,null,"2=Estructuras parcialmente removidas",null,null,null,"3=Estructuras permanecen en el sitio"]
[null,null,"Otras consideraciones"]
[null,"Fotos y diagramas (use hojas adicionales si es necesario)"]
[null,"Comentarios"]
[]
[]
[null,"Ficha Técnica para el diagnostico de Practicas de Conservación de Agua: Amuna"]
[null,"Amuna",null,null,null,null,null,null,null,null,null,null,null,null,null,"Fecha"]
[null,"Ubicación de la Amuna (describir)",null,null,null,"Norte",null,null,null,"Este",null,null,null,"Zona",null,null,null,"Datum"]
[]
[null,"Ubicación de la Amuna (describir)",null,null,null,"-------------------------------------"]
[null,"Características físicas de la Amuna",null,null,null,"Área superficial (m2)",null,null,null,"Pendiente",null,null,null,"Profundidad "]
[null,null,null,null,null,null,null,null,null,null,null,null,null,"Ancho:",null,null,null,"Alto:"]
[null,"Tipo de ecosistema"]
[null,"Tipo de vegetación "]
[null,"Identificación de red hídrica"]
[null,"Tipo de construcción"]
[null,"Suelos disturbados (describir)"]
[null,"Obras de rehabilitación existentes (describir)"]
[null,"Aspectos de análisis","Accesibilidad",null,null,"0= Bote, helicóptero,\navión",null,null,null,"1= Recorrido largo en vehículo o a pie en vía no demarcada",null,null,null,"2= En vehículo seguido　de distancia corta a pie(<500m)",null,null,null,"3= Adyacente a áreas pobladas, corta distancia en vehículo o corta distancia a pie."]
[null,null,"Potencial de colapso",null,null,"0= Ninguno",null,null,null,"1=Cimentaciones en buenas condiciones, construcciones a nivel del suelo",null,null,null,"2=Cimentaciones deterioradas, construcciones de poca elevación",null,null,null,"3=Cimentaciones deterioradas, caída de escombros construcciones elevadas"]
[null,null,"Condiciones de estructura",null,null,"0=Estructuras removidas y sitio rehabilitado",null,null,null,"1=Estructuras removidas y sitio no  rehabilitado",null,null,null,"2=Estructuras parcialmente removidas",null,null,null,"3=Estructuras permanecen en el sitio"]
[null,null,"Otras consideraciones"]
[null,"Fotos y diagramas (use hojas adicionales si es necesario)"]
[null,"Comentarios"]
[]
[]
[]
[]
[]
[]
[]
[]
[]
[]
[]
[]
[null,"Ficha Técnica para el diagnóstico de Prácticas de Conservación de Agua: Zanjas de Infiltración"]
[null,"Zanja de Infiltración",null,null,null,null,null,null,null,null,null,null,null,null,null,"Fecha"]
[null,"Ubicación de la Zanja de Infiltración (describir)",null,null,null,"Norte",null,null,null,"Este",null,null,null,"Zona",null,null,null,"Datum"]
[]
[null,"Ubicación de la Zanja de Infiltración (describir)",null,null,null,"-------------------------------------"]
[null,"Características físicas de la Zanja de Infiltración",null,null,null,"Área superficial (m2)",null,null,null,"Pendiente",null,null,null,"Profundidad "]
[null,null,null,null,null,null,null,null,null,null,null,null,null,"Ancho:",null,null,null,"Alto:"]
[null,"Tipo de ecosistema"]
[null,"Tipo de vegetación "]
[null,"Tipo de construcción"]
[null,"Suelos disturbados (describir)"]
[null,"Existencia de Dique",null,null,null,"Si _____",null,null,null,null,null,null,null,"No __________"]
[null,"Estado actual del Dique"]
[null,"Obras de rehabilitación existentes (describir)"]
[null,"Aspectos de análisis","Accesibilidad",null,null,"0= Bote, helicóptero,\navión",null,null,null,"1= Recorrido largo en vehículo o a pie en vía no demarcada",null,null,null,"2= En vehículo seguido　de distancia corta a pie(<500m)",null,null,null,"3= Adyacente a áreas pobladas, corta distancia en vehículo o corta distancia a pie."]
[null,null,"Potencial de colapso",null,null,"0= Ninguno",null,null,null,"1=Cimentaciones en buenas condiciones, construcciones a nivel del suelo",null,null,null,"2=Cimentaciones deterioradas, construcciones de poca elevación",null,null,null,"3=Cimentaciones deterioradas, caída de escombros construcciones elevadas"]
[null,null,"Condiciones de estructura",null,null,"0=Estructuras removidas y sitio rehabilitado",null,null,null,"1=Estructuras removidas y sitio no  rehabilitado",null,null,null,"2=Estructuras parcialmente removidas",null,null,null,"3=Estructuras permanecen en el sitio"]
[null,null,"Otras consideraciones"]
[null,"Fotos y diagramas (use hojas adicionales si es necesario)"]
[null,"Comentarios"]
[]
[]
[]
[]
[]
[]
[]
[null,"Ficha Técnica para el diagnostico de Practicas de Conservación y manejo de ecosistemas: Reforestación",null,null,null,null,null,null,null,null,null,null,null,null,null,null,null,null,null,null,null,null,"TIPO","SUBTIPO","ID-MEM","CODIGOS","ESTE (m)","NORTE (m)","COTA (m)","ANCHO (m)","ALTURA (m)","PROF./ESP. (+/- m)","AREA 2D (m)","AREA 3D (m)","PERIMETRO (m)","LONGITUD (m)","AZIMUT (°)","GRADIENTE (°)","TIPO DE MATERIAL / ESTADO","MER","OBSERVACIONES DE CAMPO"]
[null,"Reforestación",null,null,null,null,null,null,null,null,null,null,null,null,null,"Fecha",null,null,null,null,null,null,{"$f":"'[14]Componentes Totales - Mercedes '!B$17","v":"Infraestructura"},{"$f":"'[14]Componentes Totales - Mercedes '!C$17","v":"Reservorio de agua"},{"$f":"'[14]Componentes Totales - Mercedes '!D$17","v":14642},{"$f":"'[14]Componentes Totales - Mercedes '!E$17","v":"N9153"},{"$f":"'[14]Componentes Totales - Mercedes '!F$17","v":285903.44300000003},{"$f":"'[14]Componentes Totales - Mercedes '!G$17","v":8906374.523},{"$f":"'[14]Componentes Totales - Mercedes '!H$17","v":3621.0250000000001},{"$f":"'[14]Componentes Totales - Mercedes '!I$17","v":6.06},{"$f":"'[14]Componentes Totales - Mercedes '!J$17","v":1.7},{"$f":"'[14]Componentes Totales - Mercedes '!K$17","v":0.45},{"$f":"'[14]Componentes Totales - Mercedes '!L$17","v":64.5},{"$f":"'[14]Componentes Totales - Mercedes '!M$17","v":"-"},{"$f":"'[14]Componentes Totales - Mercedes '!N$17","v":33.5},{"$f":"'[14]Componentes Totales - Mercedes '!O$17","v":10.65},{"$f":"'[14]Componentes Totales - Mercedes '!P$17","v":"-"},{"$f":"'[14]Componentes Totales - Mercedes '!Q$17","v":"-"},{"$f":"'[14]Componentes Totales - Mercedes '!R$17","v":"muro de concreto."},{"$f":"'[14]Componentes Totales - Mercedes '!S$17","v":"Mer-109"},{"$f":"'[14]Componentes Totales - Mercedes '!T$17","v":"muro de concreto."}]
[null,"Ubicación del área reforestada",null,null,null,"Norte",null,null,null,"Este",null,null,null,"Zona",null,null,null,"Datum"]
[]
[null,"Ubicación de la área reforestada (describir)",null,null,null,"-------------------------------------"]
[null,"Tamaño del área ",null,null,null,"Área superficial (m2)"]
[]
[null,"Tipo de especie forestal"]
[null,"Estado de conservación del área reforestada"]
[null,"Existencia de suelo disturbados \n(describir)"]
[null,"Aspectos de análisis","Accesibilidad",null,null,"0= Bote, helicóptero,\navión",null,null,null,"1= Recorrido largo en vehículo o a pie en vía no demarcada",null,null,null,"2= En vehículo seguido　de distancia corta a pie(<500m)",null,null,null,"3= Adyacente a áreas pobladas, corta distancia en vehículo o corta distancia a pie."]
[]
[]
[null,null,"Otras consideraciones"]
[null,"Fotos y diagramas (use hojas adicionales si es necesario)"]
[null,"Comentarios"]
[]
[null,"Ficha Técnica para el diagnóstico de Prácticas de Conservación de Agua: Manejo de Pastizales"]
[null,"Manejo de Pastizales",null,null,null,null,null,null,null,null,null,null,null,null,null,"Fecha"]
[null,"Ubicación del área con manejo de pastizales",null,null,null,"Norte",null,null,null,"Este",null,null,null,"Zona",null,null,null,"Datum"]
[]
[null,"Ubicación del área (describir)",null,null,null,"-------------------------------------"]
[null,"Características físicas de la área con manejo de pastizales",null,null,null,"Área superficial (m2)"]
[]
[null,"Tipo de vegetación "]
[null,"Estado de conservación del pastizal"]
[null,"Comunidad o grupo social que tienen el uso del pastizal"]
[null,"Fotos y diagramas (use hojas adicionales si es necesario)"]
[null,"Comentarios"]

{"sheet":"FICHA GESTION","index":35,"n_rows":200,"n_cols":19,"rows_kept":200,"cut":false,"hidden":false,"merged":[[35,5,35,11],[20,5,20,8],[21,5,21,8],[22,5,22,8],[25,8,25,11],[30,1,30,11],[31,1,31,4],[32,1,35,4],[31,5,31,11],[32,5,32,11],[25,1,26,1],[25,2,26,3],[25,4,26,5],[25,6,26,6],[33,5,33,11],[34,5,34,11],[29,2,29,3],[29,4,29,5],[25,7,26,7],[27,2,27,3],[27,4,27,5],[28,2,28,3],[28,4,28,5],[8,1,8,8],[16,1,16,4],[16,5,16,8],[23,5,23,8],[24,1,24,11],[19,1,19,4],[20,1,20,4],[21,1,21,4],[22,1,22,4],[23,1,23,4],[19,5,19,8],[17,1,17,4],[18,1,18,4],[17,5,17,8],[18,5,18,8],[9,1,9,4],[9,5,9,8],[10,1,15,4],[10,5,10,8],[11,5,11,8],[12,5,12,8],[13,5,13,8],[14,5,14,8],[15,5,15,8],[40,0,40,3],[40,4,40,5],[40,8,40,9],[40,10,40,19],[41,0,41,19],[38,0,38,19],[39,0,39,3],[39,4,39,7],[39,8,39,13],[39,15,39,19],[43,0,43,19],[44,0,44,3],[44,4,44,5],[44,6,44,9],[44,10,44,12],[44,13,44,15],[44,16,44,19],[42,0,42,3],[42,6,42,8],[42,9,42,11],[42,12,42,14],[42,15,42,19],[47,0,47,19],[48,0,48,3],[48,4,48,5],[48,6,48,8],[48,9,48,11],[48,12,48,14],[48,15,48,17],[48,18,48,19],[45,0,45,19],[46,0,46,3],[46,4,46,6],[46,7,46,10],[46,11,46,14],[46,15,46,19],[75,1,75,12],[76,1,77,1],[76,2,77,2],[76,3,77,3],[76,4,77,4],[76,5,77,5],[76,6,76,7],[76,8,76,9],[76,10,77,10],[76,11,77,11],[76,12,77,12],[109,1,109,4],[109,5,109,9],[110,1,110,4],[110,5,110,9],[111,1,111,4],[111,5,111,9],[101,1,101,9],[102,1,102,4],[102,5,102,9],[103,1,108,4],[103,5,103,9],[104,5,104,9],[105,5,105,9],[106,5,106,9],[107,5,107,9],[108,5,108,9],[115,1,115,4],[115,5,115,9],[116,1,116,9],[117,2,117,3],[117,4,117,5],[117,6,117,7],[117,8,117,9],[112,1,112,4],[112,5,112,9],[113,1,113,4],[113,5,113,9],[114,1,114,4],[114,5,114,9],[120,2,120,3],[120,4,120,5],[120,6,120,7],[120,8,120,9],[121,2,121,3],[121,4,121,5],[121,6,121,7],[121,8,121,9],[118,2,118,3],[118,4,118,5],[118,6,118,7],[118,8,118,9],[119,2,119,3],[119,4,119,5],[119,6,119,7],[119,8,119,9],[124,2,124,3],[124,5,124,6],[124,9,124,10],[124,11,124,12],[125,2,125,3],[125,5,125,6],[125,9,125,10],[125,11,125,12],[122,2,122,3],[122,4,122,5],[122,6,122,7],[122,8,122,9],[123,1,123,12],[128,2,128,3],[128,5,128,6],[128,9,128,10],[128,11,128,12],[129,2,129,3],[129,5,129,6],[129,9,129,10],[129,11,129,12],[126,2,126,3],[126,5,126,6],[126,9,126,10],[126,11,126,12],[127,2,127,3],[127,5,127,6],[127,9,127,10],[127,11,127,12],[132,2,132,3],[132,5,132,6],[132,9,132,10],[132,11,132,12],[133,1,133,12],[130,2,130,3],[130,5,130,6],[130,9,130,10],[130,11,130,12],[131,2,131,3],[131,5,131,6],[131,9,131,10],[131,11,131,12],[136,2,136,3],[136,5,136,6],[136,9,136,10],[136,11,136,12],[137,2,137,3],[137,5,137,6],[137,9,137,10],[137,11,137,12],[134,2,134,3],[134,5,134,6],[134,9,134,10],[134,11,134,12],[135,2,135,3],[135,5,135,6],[135,9,135,10],[135,11,135,12],[140,2,140,3],[140,5,140,6],[140,9,140,10],[140,11,140,12],[141,2,141,3],[141,5,141,6],[141,9,141,10],[141,11,141,12],[138,2,138,3],[138,5,138,6],[138,9,138,10],[138,11,138,12],[139,2,139,3],[139,5,139,6],[139,9,139,10],[139,11,139,12],[144,2,144,3],[144,5,144,6],[144,9,144,10],[144,11,144,12],[145,2,145,3],[145,5,145,6],[145,9,145,10],[145,11,145,12],[142,2,142,3],[142,5,142,6],[142,9,142,10],[142,11,142,12],[143,1,143,12],[148,2,148,3],[148,5,148,6],[148,9,148,10],[148,11,148,12],[149,2,149,3],[149,5,149,6],[149,9,149,10],[149,11,149,12],[146,2,146,3],[146,5,146,6],[146,9,146,10],[146,11,146,12],[147,2,147,3],[147,5,147,6],[147,9,147,10],[147,11,147,12],[152,2,152,3],[152,5,152,6],[152,9,152,10],[152,11,152,12],[153,1,153,12],[150,2,150,3],[150,5,150,6],[150,9,150,10],[150,11,150,12],[151,2,151,3],[151,5,151,6],[151,9,151,10],[151,11,151,12],[156,2,156,3],[156,5,156,6],[156,9,156,10],[156,11,156,12],[157,2,157,3],[157,5,157,6],[157,9,157,10],[157,11,157,12],[154,2,154,3],[154,5,154,6],[154,9,154,10],[154,11,154,12],[155,2,155,3],[155,5,155,6],[155,9,155,10],[155,11,155,12],[160,2,160,3],[160,5,160,6],[160,9,160,10],[160,11,160,12],[161,2,161,3],[161,5,161,6],[161,9,161,10],[161,11,161,12],[158,2,158,3],[158,5,158,6],[158,9,158,10],[158,11,158,12],[159,2,159,3],[159,5,159,6],[159,9,159,10],[159,11,159,12],[164,2,164,3],[164,5,164,6],[164,9,164,10],[164,11,164,12],[165,2,165,3],[165,5,165,6],[165,9,165,10],[165,11,165,12],[162,2,162,3],[162,5,162,6],[162,9,162,10],[162,11,162,12],[163,1,163,12],[168,2,168,3],[168,5,168,6],[168,9,168,10],[168,11,168,12],[169,2,169,3],[169,5,169,6],[169,9,169,10],[169,11,169,12],[166,2,166,3],[166,5,166,6],[166,9,166,10],[166,11,166,12],[167,2,167,3],[167,5,167,6],[167,9,167,10],[167,11,167,12],[172,2,172,3],[172,5,172,6],[172,9,172,10],[172,11,172,12],[175,1,175,16],[170,2,170,3],[170,5,170,6],[170,9,170,10],[170,11,170,12],[171,2,171,3],[171,5,171,6],[171,9,171,10],[171,11,171,12],[179,1,179,6],[179,7,179,9],[179,10,179,12],[179,13,179,16],[180,1,180,6],[180,7,180,9],[180,10,180,12],[180,13,180,16],[176,1,176,3],[176,4,176,16],[177,1,177,3],[177,4,177,16],[178,1,178,6],[178,7,178,9],[178,10,178,12],[178,13,178,16],[183,1,183,6],[183,7,183,9],[183,10,183,12],[183,13,183,16],[184,1,184,6],[184,7,184,9],[184,10,184,12],[184,13,184,16],[181,1,181,6],[181,7,181,9],[181,10,181,12],[181,13,181,16],[182,1,182,6],[182,7,182,9],[182,10,182,12],[182,13,182,16],[185,1,185,6],[185,7,185,9],[185,10,185,12],[185,13,185,16],[188,1,189,1],[188,2,189,2],[188,3,189,3],[188,4,189,4],[188,5,189,5],[188,6,189,6],[188,8,188,9],[188,10,189,10],[188,11,189,11]]}
[]
[]
[]
[]
[]
[]
[]
[]
[null,"FICHA DE GESTIÓN DEL ECOSISTEMA DE INTERÉS HÍDRICO"]
[null,"Área encargada  de la gestión del ecosistema "]
[null,"Funciones del área encargada",null,null,null,1]
[null,null,null,null,null,2]
[null,null,null,null,null,3]
[null,null,null,null,null,4]
[null,null,null,null,null,5]
[null,null,null,null,null,6]
[null,"Organigrama del área encargada"]
[null,"Descripción del puesto 1"]
[null,"Perfil del funcionario en el puesto 1 "]
[null,"Descripción del puesto 2"]
[null,"Perfil del funcionario en el puesto 2 "]
[null,"Descripción del puesto 3"]
[null,"Perfil del funcionario en el puesto 3 "]
[null,"Marco normativo que indica las funciones del área"]
[null,"Trabajadores del área encargada"]
[null,"Nombres","Apellido paterno",null,"Apellido materno",null,"Cargo actual","Antigüedad","Información de la última capacitación recibida"]
[null,null,null,null,null,null,null,null,"Tema","Fecha ","Horas ","Docente/Entidad"]
[]
[]
[]
[null,"Requerimientos de temas de capacitación en gestión de ecosistemas"]
[null,"Nro de trabajadores potenciales para llevar la capacitación"]
[null,"Temas de interés"]
[]
[]
[]
[]
[]
["FICHA TÉCNICA PARA EL DIAGNÓSTICO DE SENSIBILIZACIÓN AMBIENTAL"]
["Información de sensibilización",null,null,null,"Nombre del encuestador",null,null,null,null,null,null,null,null,null,"Fecha"]
["Datos del encuestado",null,null,null,"Sexo",null,"F","M","Edad"]
["Identificación del ecosistema"]
[" ¿Existen ecosistemas naturales en su zona? ",null,null,null,"Si","No","Mencione un ecosistema ",null,null,null,null,null,"Mencione una especie "]
["Conocimiento de la importancia del  ecosistema"]
["¿Cuál cree que es la principal contribución  de un ecosistema?",null,null,null,"a) Regulación hídrica",null,"b) Provee suelo para la agricultura ",null,null,null,"c) Provee forraje para el ganado",null,null,"d) Ninguno de los anteriores"]
["Identificación de problemas en el ecosistema"]
["Señale los principales problemas ",null,null,null,"a) Disminución de forraje para animales",null,null,"b) Muerte de arboles/ arbustos/ pasturas ",null,null,null,"c) Pérdida de especies con valor productivo ",null,null,null,"d) Presencia de Cárcavas"]
["Posibles causas de los problemas en  ecosistema"]
["Señale las principales causas",null,null,null,"a) Incendios forestales",null,"b) Heladas",null,null,"c) Sequías ",null,null,"d) Sobrepastoreo",null,null,"e) Malas prácticas de manejo",null,null,"f) No tengo conocimiento"]
[]
[]
[]
[]
[]
[]
[]
[]
[]
[]
[]
[]
[]
[]
[]
[]
[]
[]
[]
[]
[]
[]
[]
[]
[]
[]
[null,"FICHA DE DIAGNÓSTICO DE INFORMACIÓN AMBIENTAL"]
[null,"Nro","Tipo de estudio","Tipo de ecosistema bajo estudio","Fecha de elaboración y aprobación","Documento de aprobación","Modalidad de ejecución",null,"Consultores",null,"Nivel de profundidad del estudio","Conclusiones mas Importantes del Estudio","Observación"]
[null,null,null,null,null,null,"In house","Contrata","Empresa","Persona natural"]
[null,1,"Informe Técnico de la Calidad del agua"]
[null,2,"Balance Hídrico"]
[null,3,"Informe de cobertura vegetal del ecosistema"]
[null,4,"Informe de introducción de especies del ecosistema"]
[null,5,"Informe de características relacionadas a la infiltración de suelos"]
[null,6,"Informe de características del clima actual y futuro"]
[null,7,"Análisis de Peligros en un contexto de cambio climático"]
[null,8,"Imágenes satelitales del ecosistema bajo estudio"]
[null,9,"Estudio de composición de suelos según ecosistema bajo estudio"]
[null,10,"Estudio de identificación de geomorfología de la zona"]
[null,11,"Diagnostico del estado actual de los canales regulación hídrica"]
[null,12,"Topografía del área de estudio"]
[null,13,"Otros estudios"]
[null,14]
[null,15]
[null,16]
[null,17]
[null,18]
[null,19]
[null,20]
[]
[]
[]
[null,"FICHA DE SEGUIMIENTO Y MONITOREO AMBIENTAL"]
[null,"Área encargada  del Seguimiento y Monitoreo Ambiental"]
[null,"Funciones del área encargada",null,null,null,1]
[null,null,null,null,null,2]
[null,null,null,null,null,3]
[null,null,null,null,null,4]
[null,null,null,null,null,5]
[null,null,null,null,null,6]
[null,"Descripción del puesto 1"]
[null,"Perfil del funcionario en el puesto 1 "]
[null,"Descripción del puesto 2"]
[null,"Perfil del funcionario en el puesto 2 "]
[null,"Descripción del puesto 3"]
[null,"Perfil del funcionario en el puesto 3 "]
[null,"Marco normativo que indica las funciones del área de Seguimiento y Monitoreo  Ambiental"]
[null,"Trabajadores del área de Seguimiento y Monitoreo  Ambiental"]
[null,"Nombres","Apellido paterno",null,"Apellido materno",null,"Cargo Actual",null,"Antigüedad"]
[]
[]
[]
[]
[]
[null,"Información de las acciones de Seguimiento y Monitoreo Ambiental Año _____________"]
[null,"Fecha ","Persona encargada",null,"Temática","Duración ",null,"Acciones de Monitoreo","Resultados Obtenidos","Equipamiento Utilizado",null,"Métodos desarrollados"]
[]
[]
[]
[]
[]
[]
[]
[]
[null,"Información de las acciones de Seguimiento y Monitoreo Ambiental Año _____________"]
[null,"Fecha ","Persona encargada",null,"Temática","Duración ",null,"Acciones de Monitoreo","Resultados Obtenidos","Equipamiento Utilizado",null,"Métodos desarrollados"]
[]
[]
[]
[]
[]
[]
[]
[]
[null,"Información de las acciones de Seguimiento y Monitoreo Ambiental Año _____________"]
[null,"Fecha ","Persona encargada",null,"Temática","Duración ",null,"Acciones de Monitoreo","Resultados Obtenidos","Equipamiento Utilizado",null,"Métodos desarrollados"]
[]
[]
[]
[]
[]
[]
[]
[]
[null,"Información de las acciones de Seguimiento y Monitoreo Ambiental Año _____________"]
[null,"Fecha ","Persona encargada",null,"Temática","Duración ",null,"Acciones de Monitoreo","Resultados Obtenidos","Equipamiento Utilizado",null,"Métodos desarrollados"]
[]
[]
[]
[]
[]
[]
[]
[]
[null,"Información de las acciones de Seguimiento y Monitoreo Ambiental Año _____________"]
[null,"Fecha ","Persona encargada",null,"Temática","Duración ",null,"Acciones de Monitoreo","Resultados Obtenidos","Equipamiento Utilizado",null,"Métodos desarrollados"]
[]
[]
[]
[]
[]
[]
[]
[]
[]
[]
[null,"FICHA TÉCNICA PARA EL DIAGNÓSTICO DE REPORTE DE INSTRUMENTOS DE GESTIÓN EXISTENTES (una ficha por acta)"]
[null,"Acta N° "]
[null,"Fecha de Reunión"]
[null,"Listado de organizaciones participantes",null,null,null,null,null,"Rubro",null,null,"Intereses",null,null,"Acuerdos"]
[]
[]
[]
[]
[]
[]
[]
[]
[]
[null,"Nro","Tipo de Instrumento","Nombre del Instrumento","Fecha de elaboración y aprobación","Documento de aprobación","Observación",null,null,null,null,"Observación"]
[]
[null,1]
[null,2]
[null,3]
[null,4]
[null,5]
[null,6]
[null,7]
[null,8]
[null,9]
[null,10]

{"sheet":"FORMATO DE INFORME","index":36,"n_rows":37,"n_cols":2,"rows_kept":37,"cut":false,"hidden":false,"merged":[[7,1,7,12],[10,0,10,7],[10,9,10,11],[8,1,8,12],[11,1,11,12],[12,1,12,12],[13,1,13,12],[14,1,14,12],[15,1,15,12],[18,1,18,12],[19,1,19,12],[20,1,20,12],[21,1,21,12],[22,1,22,12],[25,1,25,12],[26,1,26,12],[29,1,29,12],[32,1,32,12],[35,1,35,12],[36,1,36,12]]}
[]
[]
[]
[]
[]
[]
[]
[null,"I. OBJETIVO DEL ESTUDIO"]
[]
[]
[]
[null,"II. METODOLOGÍA"]
[null,"A. MÉTODOS Y PROCEDIMIENTOS"]
[]
[null,"B. FUENTES DE INFORMACIÓN"]
[]
[]
[]
[null,"III. PARÁMETROS TÉCNICOS ANALIZADOS"]
[null,"A. "]
[null,"Definición\n\n\n\n\n\nProcedimientos\n"]
[null,"B"]
[null,"Definición\n\n\n\n\n\nProcedimientos\n"]
[]
[]
[null,"IV. ANÁLISIS DE RESULTADOS"]
[]
[]
[]
[null,"V. CONCLUSIONES"]
[]
[]
[null,"VI. RECOMENDACIONES"]
[]
[]
[null,"VII. ANEXOS"]
[null,"- Mapas\n- Análisis del laboratorio\n- Panel fotográfico"]

{"sheet":"ESCALA","index":37,"n_rows":10,"n_cols":5,"rows_kept":10,"cut":false,"hidden":false,"merged":[[7,1,7,3],[8,1,8,3],[9,1,9,3],[7,4,7,9],[8,4,8,9],[9,4,9,9]]}
[]
[]
[]
[]
[]
[]
[]
[null,"BUENA",null,null,"MÁS DEL 70% DEL RECORRIDO TOTAL SE PUEDE TRANSITAR CON VEHÍCULO"]
[null,"REGULAR",null,null,"ENTRE 30% Y 69% DEL RECORRIDO CON ACCESO VÍA VEHÍCULO"]
[null,"MALA",null,null,"SOLAMENTE EL 29% O MENOS DEL RECORRIDO SE REALIZA CON VEHÍCULO"]

{"sheet":"DOCUMENTOS DE TALLER","index":38,"n_rows":0,"n_cols":0,"rows_kept":0,"cut":false,"hidden":false,"merged":[]}

{"sheet":"MÉTODO RAS","index":39,"n_rows":105,"n_cols":11,"rows_kept":105,"cut":false,"hidden":false,"merged":[[78,2,78,5],[78,6,78,9],[78,10,78,13],[10,1,10,25],[76,2,76,13],[77,2,77,5],[77,6,77,9],[77,10,77,13],[79,2,79,5],[79,6,79,9],[79,10,79,13],[80,2,80,5],[80,6,80,9],[80,10,80,13],[81,2,81,5],[81,6,81,9],[81,10,81,13],[82,2,82,5],[82,6,82,9],[82,10,82,13],[94,2,94,9],[94,10,94,13],[83,2,83,5],[83,6,83,9],[83,10,83,13],[86,2,86,13],[87,2,87,13],[88,2,88,9],[88,10,88,13],[89,2,89,9],[89,10,89,13],[90,2,90,9],[90,10,90,13],[93,2,93,13],[95,2,95,9],[95,10,95,13],[96,2,96,9],[96,10,96,13],[97,2,97,9],[97,10,97,13],[98,2,98,9],[98,10,98,13],[99,2,99,9],[99,10,99,13],[100,2,100,9],[100,10,100,13],[101,2,101,9],[101,10,101,13],[102,2,102,9],[102,10,102,13],[103,2,103,9],[103,10,103,13]]}
[]
[]
[]
[]
[]
[]
[]
[]
[]
[]
[null,"RELACIÓN ENTRE LA PRECIPITACIÓN Y EL ESCURRIMIENTO TOTAL"]
[]
[]
[]
[]
[]
[]
[]
[]
[]
[]
[]
[]
[]
[]
[]
[]
[]
[]
[]
[]
[]
[]
[]
[]
[]
[]
[]
[]
[]
[]
[null,null,null,null,null,null,"Fuente: VT Chow, citado por Aranda (1998)"]
[]
[]
[]
[]
[]
[]
[]
[]
[]
[]
[]
[]
[]
[]
[]
[]
[]
[]
[]
[]
[]
[]
[]
[]
[]
[]
[]
[]
[null,null,null,null,null,null,"Fuente: Adaptado de Junker (2005)"]
[]
[]
[]
[]
[]
[null,null,"TABLA 1"]
[null,null,"Por pendiente",null,null,null,"kp",null,null,null,"Profundiad hacia agua subterránea"]
[null,null,"Muy plano (transparente)",null,null,null,0.4]
[null,null,"< 15% (transparente)",null,null,null,0.15,null,null,null,"2 - 1 m"]
[null,null,"15 - 30% (blanco)",null,null,null,0.1]
[null,null,"30 - 50% (amarillo)",null,null,null,7.0000000000000007E-2,null,null,null,"< 1m"]
[null,null,"50 - 70% (rojo)",null,null,null,0.05,null,null,null,"Tejido urbano cerrado,  …........"]
[null,null,"> 70% (azul)",null,null,null,0.01]
[]
[]
[null,null,"TABLA 2"]
[null,null,"Por textura de suelo"]
[null,null,"Suelos arcillosos, litosoles de altura y suelos compactos impermeables",null,null,null,null,null,null,null,0.1]
[null,null,"Suelos de combinación de limo y arcilla, litosol y regosol de valles",null,null,null,null,null,null,null,0.15]
[null,null,"Suelo arenoso, recientes, suelos de cauces de ríos y suelos no muy compactos",null,null,null,null,null,null,null,0.2]
[]
[]
[null,null,"TABLA 3"]
[null,null,"Por cobertura vegetal (ejemplos) ",null,null,null,null,null,null,null,"kv"]
[null,null,"Cuerpos de agua",null,null,null,null,null,null,null,0]
[null,null,"Salinera",null,null,null,null,null,null,null,0.05]
[null,null,"Playa, dunas y arena",null,null,null,null,null,null,null,7.0000000000000007E-2]
[null,null,"Pasto natural, zonas urbanas discontinuas, caña, grano básico, etc.",null,null,null,null,null,null,null,0.1]
[null,null,"Confieras, palmeras. Zona urbanas verdes, etc.",null,null,null,null,null,null,null,0.15]
[null,null,"Vegetación arbustiva, plantanales y bananeras, tejifo urbano, zonas comerciales, aeropuertos, etc.",null,null,null,null,null,null,null,0.18]
[null,null,"Bosque de café",null,null,null,null,null,null,null,0.19]
[null,null,"Bosques, lava reciente, etc.",null,null,null,null,null,null,null,0.2]
[null,null,"Vegetación esclerofila o espinos, cultivo de piña",null,null,null,null,null,null,null,0.3]
[null,null,"Fuente: Adaptado de Junker (2005)"]

{"sheet":"ARBOL","index":40,"n_rows":23,"n_cols":28,"rows_kept":23,"cut":false,"hidden":false,"merged":[[19,2,19,8],[19,15,19,21],[19,23,19,28],[7,5,7,24],[10,1,10,2],[10,5,10,6],[10,8,10,9],[10,14,10,15],[10,18,10,19],[10,21,10,22],[10,24,10,25],[10,27,10,28],[13,1,13,6],[13,8,13,15],[13,19,13,24],[16,5,16,24],[22,24,22,25],[22,27,22,28],[22,1,22,2],[22,5,22,6],[22,8,22,9],[22,14,22,15],[22,18,22,19],[22,21,22,22],[22,11,22,12]]}
[]
[]
[]
[]
[]
[]
[]
[null,null,null,null,null,{"$f":"+IF('6.PROBLEMA-OBJETIVO'!B61=\"\",\"\",'6.PROBLEMA-OBJETIVO'!B61)","v":"DISMINUCIÓN DEL APROVECHAMIENTO SOSTENIBLE DEL CAPITAL NATURAL"}]
[]
[]
[null,{"$f":"+IF('6.PROBLEMA-OBJETIVO'!F46=\"\",\"\",'6.PROBLEMA-OBJETIVO'!F46)","v":"DISMINUCIÓN DE LA OFERTA DEL AGUA POTABLE PARA USO POBLACIONAL"},null,null,null,{"$f":"+IF('6.PROBLEMA-OBJETIVO'!F47=\"\",\"\",'6.PROBLEMA-OBJETIVO'!F47)","v":"DISMINUCIÓN DE LA OFERTA DEL AGUA PARA USO AGROPECUARIO"},null,null,{"$f":"+IF('6.PROBLEMA-OBJETIVO'!F48=\"\",\"\",'6.PROBLEMA-OBJETIVO'!F48)","v":"DISMINUCIÓN DE LA OFERTA DEL AGUA PARA USO ENERGÉTICO"},null,null,null,null,null,{"$f":"+IF('6.PROBLEMA-OBJETIVO'!F49=\"\",\"\",'6.PROBLEMA-OBJETIVO'!F49)","v":"DISMINUCIÓN DEL SERVICIO ECOSISTÉMICO DE PROVISIÓN DE LOS RECURSOS GENÉTICOS"},null,null,null,{"$f":"+IF('6.PROBLEMA-OBJETIVO'!F50=\"\",\"\",'6.PROBLEMA-OBJETIVO'!F50)","v":"DISMINUCIÓN DEL SERVICIO ECOSISTÉMICO DE PROVISIÓN DE COMBUSTIBLE"},null,null,{"$f":"+IF('6.PROBLEMA-OBJETIVO'!F51=\"\",\"\",'6.PROBLEMA-OBJETIVO'!F51)","v":"DISMINUCIÓN DEL SERVICIO ECOSISTÉMICO DE PROVISIÓN DE FORRAJE"},null,null,{"$f":"+IF('6.PROBLEMA-OBJETIVO'!F52=\"\",\"\",'6.PROBLEMA-OBJETIVO'!F52)","v":"DISMINUCIÓN DEL SERVICIO ECOSISTÉMICO DE PROVISIÓN DE MEDICINAS NATURALES"},null,null,{"$f":"+IF('6.PROBLEMA-OBJETIVO'!F53=\"\",\"\",'6.PROBLEMA-OBJETIVO'!F53)","v":"DISMINUCIÓN DEL SERVICIO ECOSISTÉMICO DE PROVISIÓN DE PRODUCTOS BIOQUÍMICOS"}]
[]
[]
[null,{"$f":"+IF('6.PROBLEMA-OBJETIVO'!B46=\"\",\"\",'6.PROBLEMA-OBJETIVO'!B46)","v":"MENOR DISPONIBILIDAD DEL SERVICIO ECOSISTÉMICOS DE PROVISIÓN DEL RECURSO HÍDRICO"},null,null,null,null,null,null,null,null,null,null,null,null,null,null,null,null,null,{"$f":"+IF('6.PROBLEMA-OBJETIVO'!B49=\"\",\"\",'6.PROBLEMA-OBJETIVO'!B49)","v":"INCREMENTO EN EL DETERIORO DE LOS ECOSISTEMAS"}]
[]
[]
[null,null,null,null,null,{"$f":"+IF('6.PROBLEMA-OBJETIVO'!B28=\"\",\"\",'6.PROBLEMA-OBJETIVO'!B28)","v":"DISMINUCIÓN DEL SERVICIO ECOSISTÉMICO DE REGULACIÓN HÍDRICA EN LA MICROCUENCA DE 0"}]
[]
[]
[null,null,{"$f":"+IF('6.PROBLEMA-OBJETIVO'!B35=\"\",\"\",'6.PROBLEMA-OBJETIVO'!B35)","v":"DISMINUCIÓN DE CAPACIDAD DE ALMACENAMIENTO DEL AGUA EN EL ECOSISTEMA PRINCIPAL"},null,null,null,null,null,null,null,null,null,null,null,null,{"$f":"+IF('6.PROBLEMA-OBJETIVO'!B38=\"\",\"\",'6.PROBLEMA-OBJETIVO'!B38)","v":"DISMINUCIÓN DE LA CAPACIDAD DE INFILTRACIÓN DEL AGUA EN EL ECOSISTEMA ASOCIADO"},null,null,null,null,null,null,null,{"$f":"+IF('6.PROBLEMA-OBJETIVO'!B41=\"\",\"\",'6.PROBLEMA-OBJETIVO'!B41)","v":"INADECUADA GESTIÓN DEL SERVICIO ECOSISTÉMICO DE REGULACIÓN HÍDRICA"}]
[]
[]
[null,{"$f":"+IF('6.PROBLEMA-OBJETIVO'!F35=\"\",\"\",'6.PROBLEMA-OBJETIVO'!F35)","v":"ALTERACIÓN DE LA COBERTURA VEGETAL NATIVA"},null,null,null,{"$f":"+IF('6.PROBLEMA-OBJETIVO'!F36=\"\",\"\",'6.PROBLEMA-OBJETIVO'!F36)","v":"ALTERACIÓN DE LAS CARACTERÍSTICAS DE LA TURBA "},null,null,{"$f":"+IF('6.PROBLEMA-OBJETIVO'!F37=\"\",\"\",'6.PROBLEMA-OBJETIVO'!F37)","v":"CAMBIO EN EL RÉGIMEN DE PRECIPITACIONES Y TEMPERATURAS"},null,null,null,null,null,{"$f":"+IF('6.PROBLEMA-OBJETIVO'!F38=\"\",\"\",'6.PROBLEMA-OBJETIVO'!F38)","v":"DISMINUCIÓN DE LA COBERTURA VEGETAL NATIVA"},null,null,null,{"$f":"+IF('6.PROBLEMA-OBJETIVO'!F39=\"\",\"\",'6.PROBLEMA-OBJETIVO'!F39)","v":"ALTERACIÓN DE LAS CARACTERÍSTICAS DEL SUELO"},null,null,{"$f":"+IF('6.PROBLEMA-OBJETIVO'!F40=\"\",\"\",'6.PROBLEMA-OBJETIVO'!F40)","v":"CAMBIO EN EL RÉGIMEN DE PRECIPITACIONES Y TEMPERATURAS"},null,null,{"$f":"+IF('6.PROBLEMA-OBJETIVO'!F41=\"\",\"\",'6.PROBLEMA-OBJETIVO'!F41)","v":"INADECUADO MANEJO DE LOS ECOSISTEMAS DE INTERÉS HÍDRICO"},null,null,{"$f":"+IF('6.PROBLEMA-OBJETIVO'!F42=\"\",\"\",'6.PROBLEMA-OBJETIVO'!F42)","v":"INADECUADA CAPACIDAD DE GESTIÓN DE LOS ECOSISTEMAS DE INTERÉS HÍDRICO"}]

{"sheet":"COMUNICACIÓN TÉCNICA","index":41,"n_rows":292,"n_cols":11,"rows_kept":292,"cut":false,"hidden":false,"merged":[[269,4,269,6],[272,7,273,7],[272,8,273,8],[290,1,290,10],[291,1,292,10],[288,6,288,9],[261,4,261,6],[202,2,202,7],[203,2,203,7],[204,2,204,7],[205,2,205,7],[209,1,209,10],[210,1,211,10],[221,4,221,6],[229,4,229,6],[237,4,237,6],[245,4,245,6],[253,4,253,6],[201,2,201,7],[191,2,192,8],[191,9,192,9],[191,10,192,10],[193,2,193,7],[194,2,194,7],[195,2,195,7],[196,2,196,7],[197,2,197,7],[198,2,198,7],[199,2,199,7],[200,2,200,7],[189,1,189,10],[170,1,170,10],[171,1,171,10],[172,1,172,10],[174,1,174,10],[176,1,176,10],[177,1,178,10],[180,1,180,10],[181,1,182,10],[183,1,183,10],[185,1,185,10],[186,1,187,10],[167,1,168,10],[148,1,148,10],[153,2,153,8],[155,1,155,10],[156,1,156,10],[157,1,157,10],[158,1,158,10],[159,1,159,10],[160,1,160,10],[162,1,162,10],[163,1,164,10],[166,1,166,10],[146,2,146,8],[54,1,54,10],[55,1,56,10],[58,1,58,10],[59,1,60,10],[63,1,63,10],[109,1,109,10],[111,1,111,10],[112,1,113,10],[115,1,115,10],[136,2,136,8],[138,1,138,10],[51,1,52,10],[5,1,5,10],[7,1,7,10],[8,1,10,10],[12,1,12,10],[41,1,41,10],[42,1,43,10],[44,1,44,10],[45,1,46,10],[47,1,47,10],[48,1,48,10],[50,1,50,10]]}
[]
[]
[]
[]
[]
[null,"\n"]
[]
[null,"1.- RELACIÓN ENTRE LA PRECIPITACIÓN Y EL ESCURRIMIENTO TOTAL\n      Aranda, C. (1998)"]
[null,"El escurrimiento es la parte de la precipitación que fluye por gravedad por la superficie del terreno o en el interior del mismo.\nEl escurrimiento total en una cuenca tiene varios componentes como la precipitación en exceso, el escurrimiento superficial, las precipitaciones en cauces, escurrimientos sub superficiales rápidos, escurrimientos subterráneos y escurrimientos sub superficiales lentos. Sin embargo, para fines prácticos, el escurrimiento total se clasifica generalmente en ESCURRIMIENTO DIRECTO y ESCURRIMIENTO BASE; el primero integrado por los cuatro primeros (precipitación en exceso, el escurrimiento superficial, las precipitaciones en cauces, escurrimientos sub superficiales rápidos) y el segundo integrado por dos últimos (escurrimientos subterráneos y escurrimientos sub superficiales lentos). \n\nAsimismo, el escurrimiento también es conocido como gasto de un cauce, descarga de una corriente, rendimiento de una cuenca, aportación liquida, normalmente se expresa en tres formas:\n      a. Volumen en la unidad de tiempo usualmente en m3/s o equivalencias \n      b. Gasto unitario m3/s/km2 o o equivalencias\n      c. En lámina o tirante equivalente sobre cuenca, en milímetros por día, por mes o por año."]
[]
[]
[]
[null,"Relación entre la precipitación y el escurrimiento total"]
[]
[]
[]
[]
[]
[]
[]
[]
[]
[]
[]
[]
[]
[]
[]
[]
[]
[]
[]
[]
[]
[]
[]
[]
[]
[]
[]
[]
[null,"2.- LA PROPUESTA METODOLÓGICA"]
[null,"Se elaboró una propuesta metodológica de la estimación del escurrimiento base que aporta al escurrimiento total por efecto de la recuperación de los ecosistemas en la cuenca, el cual es un insumo para la ficha estándar de recuperación del servicio ecosistémico de regulación hídrica. Se integraron factores climáticos, biofísicos y ecosistémicos, así como criterios técnicos."]
[]
[null,"3.- LIMITACIONES Y SUPUESTOS DE LA PROPUESTA"]
[null,"La descripción del ítem 1, constituye una relación muy simplificada del ciclo hidrológico del escurrimiento; dicho proceso es mucho más complicado debido a que influyen muchos otros factores que pueden varias de un lugar a otro, como las variables meteorológicas, las otras formas de precipitación, la humedad del suelo, la permeabilidad o impermeabilidad de la geología, las recargas de otras cuencas, la interconexión de los acuíferos, factores humanos, entre otros.\n\nCon relación a los supuestos, para fines prácticos, el escurrimiento total se clasificó en escurrimiento directo y escurrimiento base. Asimismo, en ecosistemas deteriorados, su efecto en la infiltración disminuye el valor de kv en un 50%."]
[]
[null,"4.- LA METODOLOGÍA CONSTA DE TRES FASES"]
[]
[]
[null,"Fase 1: es la recopilación y análisis de la información"]
[null,"Seleccionar información de precipitación, estimación de la evapotranspiración, tipo de ecosistemas, tipo de suelos, pendientes, coeficientes de infiltración potencial, y mapas temáticos si es necesario."]
[]
[]
[null," Fase 2: Estimación de la recarga potencial por infiltración."]
[null,"• Paso 1.- BC=P-ET; donde: BC=Balance Climático; P= Precipitación (mm/año); ET=Evapotraspiración (mm/año)\n• Paso 2.- C=(kv+kp+ks); donde: C=coeficiente de infiltración; kv=fracción que infiltra por efecto del tipo de ecosistema; kp= fracción que infiltra por efecto de la pendiente y ks= fracción que infiltra por efecto del tipo de suelo, su textura (adimencionales)\n• Paso 3.- R=BC*C; donde: R=recarga potencial por infiltración (mm/año)\n• Paso 4.- Siendo la intervención en 1 ha, se tiene la siguiente conversión. 10*R= (m3/año-ha)."]
[]
[]
[null,"Fase 3: Estimación del escurrimiento base que aporta al escurrimiento total\n  Basado en Gómez S; Guzmán, J. (2011)"]
[null,"Se aplica un análisis probabilidades bajo un escenario conservador (muy bajo 20%, bajo 30%, moderado 50%)  a la recarga potencial por infiltración (R), para estimar el escurrimiento base que aporta al escurrimiento total."]
[]
[]
[]
[null,"Esquema de las Fases para la estimación del escurrimiento base que aporta al escurrimiento total por efecto de la recuperación de los ecosistemas en la cuenca"]
[]
[]
[]
[]
[]
[]
[]
[]
[]
[]
[]
[]
[]
[]
[]
[]
[]
[]
[]
[]
[]
[]
[]
[]
[]
[]
[]
[]
[]
[]
[]
[]
[]
[]
[]
[]
[]
[]
[]
[]
[]
[]
[]
[]
[]
[null,"5.- ESTIMACIÓN DE UNA SITUACIÓN CON PROYECTO Y SIN PROYECTO"]
[]
[null,"Tablas de kv ; kp y ks\nBasado en Mapa Nacional de Ecosistemas del Perú, MINAM"]
[null,"Las tablas kv; kp y ks; que estiman la fracción que infiltra por efecto del tipo de ecosistema, % de pendiente y suelo respectivamente son las siguientes :"]
[]
[]
[null,"Tabla 1.- valores de kv, con proyecto y sin proyecto"]
[null,null,null,null,null,null,"CP","SP"]
[null,null,null,null,"N°","Ecosistemas","Kv","Kvo"]
[null,null,null,null,1,"bosque basimontano de yunga",0.2,{"$f":"G119/2","v":0.1}]
[null,null,null,null,2,"bosque montano de yunga",0.2,{"$f":"G120/2","v":0.1}]
[null,null,null,null,3,"bosque altimontano (pluvial) de yunga",0.2,0.1]
[null,null,null,null,4,"matorral montano",0.15,7.4999999999999997E-2]
[null,null,null,null,5,"páramo",0.08,0.04]
[null,null,null,null,6,"pajonal de puna seca",0.1,0.05]
[null,null,null,null,7,"pajonal de puna humeda",0.1,0.05]
[null,null,null,null,8,"bofedal",0.05,2.5000000000000001E-2]
[null,null,null,null,9,"zona periglaciar y glaciar",0.05,2.5000000000000001E-2]
[null,null,null,null,10,"jalca",0.1,0.05]
[null,null,null,null,11,"matorral de puna seca",0.1,0.05]
[null,null,null,null,12,"bosque relicto altoandino (queñual entre otros)",0.2,0.1]
[null,null,null,null,13,"bosque relicto montano de vertiente occidental",0.2,0.1]
[null,null,null,null,14,"bosque relicto mesoandino",0.2,0.1]
[null,null,null,null,15,"bosque estacionalmente seco interandino",0.25,0.125]
[null,null,null,null,16,"Matorral andino",0.15,7.4999999999999997E-2]
[null,null,null,null,17,"lago y lagunas",0,0]
[null,null,null,null,18,"ríos",0,0]
[null,null,"Fuente: Adaptado de MINAM (2019) y Junker, M. (2005) "]
[]
[null,"Tabla 2.- valores de kp"]
[null,null,null,null,"N°","Rango de % de pendiente","kp"]
[null,null,null,null,1,"muy plano",0.4]
[null,null,null,null,2,"< 15%",0.15]
[null,null,null,null,3,"15-30%",0.1]
[null,null,null,null,4,"30-50%",7.0000000000000007E-2]
[null,null,null,null,5,"50-70%",0.05]
[null,null,null,null,6,">70%",0.01]
[null,null,"Fuente: Junker, M. (2005)"]
[]
[null,"Tabla 3.- valores de ks"]
[null,null,null,null,"N°","Por textura del suelo","Ks"]
[null,null,null,null,1,"Suelos arcillosos, litosoles de altura y suelos compactos impermeables",0.1]
[null,null,null,null,2,"Suelos de combinación de limo y arcilla, Litosol y Regosol de valles",0.15]
[null,null,null,null,3,"Suelo arenoso, recientes, suelos de cauces de rios y suelos no muy compactos",0.2]
[null,null,"Fuente: Junker, M. (2005)"]
[]
[null,"6.- MEDICION DEL CAUDAL"]
[null,"El caudal es la tasa a la que el agua discurre a través de una sección transversal; se expresa en unidades de volumen por unidad de tiempo, [l/s] para flujos pequeños y [m3/s] para flujos mayores. En ocasiones, el caudal también se expresa en unidades de volumen por unidad de tiempo y por área de influencia, [l/s/km2]. Por lo general, el valor de caudal se expresa en función de la altura del agua en una estación de aforo, la misma que tiene como propósito llevar registros continuos y sistemáticos de la altura del agua y el caudal fluvial (OMM, 2011). Por tal razón, estas estaciones deben contar con limnígrafos (p. ej. sensores de nivel automáticos) encargados de las mediciones de altura de agua y una sección de control (estructura de medición), misma que, debe tener características geométricas conocidas y estables que permitan determinar el flujo del agua que pasa  a través de ella."]
[null,"Ejemplos de vertederos de sección triangular y rectangular combinadas"]
[]
[null,"Izq: vertedero en el páramo del volcán Pichincha, Lloa (CONDESAN). Der: vertedero en la cuenca del río Zhurucay, Paute (Grupo de Ciencias de la Tierra y del Ambiente de la Universidad de Cuenca).\nFuente: Guía metodológica para el monitoreo hidrológico de ecosistemas andinos – iMHEA Versión 27 de Agosto de 2013"]
[null,"En corrientes fluviales de montaña donde existen flujos moderados, la medición de los caudales se debe realizar por medio de la construcción de un vertedero en la salida de la cuenca y la instalación de un sensor de nivel de agua. Para microcuencas pequeñas el vertedero deberá tener una sección combinada rectangular y triangular (Figura 3) para que se puedan medir los caudales bajos y los caudales pico.\n\nLos caudales son calculados a partir de la relación altura del agua - caudal, lo que es conocido como curva de descarga. Gráficamente, los caudales se colocan en el eje de las abscisas (x) y la altura correspondiente en el eje de las ordenadas (y); en coordenadas rectangulares, la gráfica suele tener forma cóncava invertida ya que el caudal viene frecuentemente descrito por una función de potencial de la profundidad del flujo (OMM, 2011). La relación altura del agua – caudal, está en función de la geometría de los elementos del canal o estructura de control (natural o artificial) aguas abajo. Cuando se trata de un vertedero, esta relación está implícita dentro de la ecuación que caracteriza la descarga a través de la estructura."]
[]
[null,"Vertederos"]
[null,"Los vertederos son dispositivos hidráulicos que consisten en una escotadura (de geometría conocida) a través de la cual circula el flujo que se quiere medir. Según el Protocolo de Monitoreo y Seguimiento del Agua (IDEAM, 2007), se recomienda obtener velocidades mínimas (0.15 m/s) en el sitio de emplazamiento del vertedero, debido a que el caudal que fluye por un vertedero depende de la velocidad de llegada; y si la velocidad es considerablemente alta, el aforo pierde precisión (IDEAM, 2007). Por lo tanto, se deberá buscar un lugar de emplazamiento que cumpla con esta característica, y de no ser posible, se podría optar por una ampliación de la sección en la zona de aproximación al lugar de medición (caso extremo).\n\nLos límites de caudal (máximo y mínimo) previstos a medir, determinan la elección del tipo y las dimensiones del vertedero. En todos los casos deberá tomarse en consideración (IDEAM, 2007):\n\n• La altura no debe ser inferior a 6 centímetros para el caudal previsto y no debe exceder de 60 cm (vertedero triangular).\n•  Para vertederos rectangulares la altura no debe exceder de un tercio de la longitud del vertedero."]
[]
[]
[null,"Lugar de emplazamiento del vertedero"]
[null,"De acuerdo a la Organización Meteorológica Mundial (OMM, 2011), el lugar de emplazamiento de una estación de medición de caudal en una corriente fluvial debería responder a las siguientes características:\n\n• El curso general de la corriente será rectilíneo a lo largo de aproximadamente 100 m corriente arriba y corriente abajo respecto del emplazamiento de medición. En las cuencas andinas esta condición es muy difícil de conseguir. Se recomienda buscar  lugares que tengan 6 m corriente arriba y 2 m corriente abajo.\n• El flujo total estará confinado en un canal para todo el intervalo de alturas, y no habrá flujos subsuperficiales que no pasen por el emplazamiento.\n• El lecho fluvial no habrá experimentado erosión y deposición, y estará exento de maleza.\n• Las márgenes serán permanentes y suficientemente altas para contener las crecidas.\n• Se dispondrá de un emplazamiento, inmediatamente corriente arriba del control, en el que se haga el registro de alturas de agua y que conste con las seguridades pertinentes.\n• El emplazamiento de medición estará lo suficientemente lejos corriente arriba de la confluencia con otra corriente fluvial o de los efectos de las mareas como para evitar toda influencia variable de la otra corriente fluvial o marea sobre la altura del agua en el emplazamiento de medición. La distancia mínima se determinará en campo por personal técnico calificado.\n• El emplazamiento será fácilmente accesible a efectos de instalación y utilización de la estación de aforo.\n• Incluso en presencia de hielo debería ser posible registrar la altura y medir el caudal.\n• En las proximidades de la estación de aforo no habrá olas ni ondulaciones en la superficie del agua.\n\nPor ello, es importante que personal técnico calificado determine el lugar más apropiado para el emplazamiento de la estación."]
[]
[]
[null,"Geometría y ecuación del vertedero"]
[null,"Las características geométricas del vertedero determinan el caudal que se descarga a través de él. Entre las más comunes se encuentran la sección rectangular y la sección triangular. La propuesta de la iMHEA, es la utilización de un vertedero de sección combinada (Figura 1); sección triangular para la medición de caudales bajos, y una sección rectangular para medir caudales pico. En el Ecuador, en la cuenca del río Zhurucay (Provincia del Azuay), se han utilizado vertederos de sección combinada tal como propone la iMHEA. Estos están compuestos por una sección triangular con θ=90°, ht= 0.30 m, Lt= 0.60 m y una sección rectangular con Lr= entre 1.4 y 2.60 m. La ecuación para el cálculo del caudal es:"]
[null,"Donde:\nQ: Caudal [l/s]\nH: altura de agua desde el vértice hasta la superficie de agua [m]\nht: altura de la sección triangular [m]\nhr: altura de agua sobre la sección triangular [m]\nLt: ancho de la sección triangular [m]\nLr: ancho de la sección rectangular [m]\nB= Lr – Lt: ancho de la sección rectangular (ancho total del vertedero [Lr] menos el ancho de la sección triangular [Lt]) [m]"]
[]
[null,"En la práctica, cada vertedero deberá acoplarse a las condiciones geográficas de su sitio de implantación, y por tanto, variarán las dimensiones de uno a otro. Por ello, se considera importante introducir una ecuación general para el cálculo del caudal sobre un vertedero de sección combinada (Villacís et al., 2013), la cual debe ser afinada determinando un coeficiente de descarga en cada caso.\n\nEl coeficiente de descarga, para el vertedero deberá obtenerse experimentalmente mediante una prueba de campo, la misma que será realizada por personal técnico capacitado. Una forma de conseguirlo es la calibración de la ecuación en base a un aforo manual que determine el caudal y lo relacione con la altura en ese instante.  Adicionalmente, este aforo manual, deberá convertirse en una práctica común en cada visita a la estación con el objeto de validar la ecuación del vertedero. "]
[]
[null,"Nivel de agua"]
[null,"La altura o nivel del agua es la elevación de la superficie de una corriente fluvial respecto de un nivel de referencia. Mediante su correlación con el caudal fluvial constituye el punto de partida para obtener registros de caudal (OMM, 2011). La medición se debe realizar de dos formas: (i) la primera de tipo continuo y automático a través de sensores de presión que pueden ser integrados en un solo equipo que realice la medición directa del nivel del agua, o independientes, instalados en parejas, uno dentro de la corriente fluvial y otro en la superficie para medir la presión atmosférica y realizar la compensación respectiva; (ii) la segunda de tipo manual, mediante la instalación de una regleta graduada milimétricamente (limnímetro), que se instalará en un punto muy cercano al de los sensores automáticos y que servirá para la validación de estos datos.\n\nDe acuerdo a la Guía de Prácticas Hidrológicas (OMM, 2011), para que las mediciones de nivel del agua sean apropiadas para su uso en la medición del caudal mediante una estructura de control (vertedero), ésta deberá realizarse a una distancia no menor a 3 veces hmax aguas arriba de la sección de control, donde hmax es la máxima altura para la cual la sección de control es efectiva (altura de la cresta del vertedero). La medición no puede realizarse en el mismo lugar de emplazamiento de la estructura ya que debido al efecto de contracción de la lámina de agua a su paso por la cresta del vertedero, esta medición no sería la carga real actuando en el mismo (Sotelo Dávila, 1997).\n\nPor otra parte, la altura del agua que debe ser medida es aquella que está actuando sobre la estructura de control (carga hidráulica), por lo tanto, la cota de referencia para la medición del nivel del agua debe ser igual a la cota de la cresta del vertedero, es decir, el nivel del agua por encima del vértice de la platina metálica."]
[]
[]
[null,"Aforos manuales y observación de nivel de agua"]
[null,"En la operación del sistema de monitoreo, durante cada descarga de datos, se debe realizar un aforo manual del caudal que escurre por él. Este aforo permite que la información registrada por el sensor de nivel sea fácilmente validada con información real de campo. El aforo manual se realiza con un recipiente de volumen conocido en el cual se recepta el agua que fluye por el vertedero y se registra el tiempo necesario para llenar el recipiente. El uso de recipientes de mayor volumen disminuye los errores en las mediciones. El cálculo de caudal se efectúa dividiendo el volumen del recipiente para el tiempo que tardó en llenarse. Se deben realizar por lo menos tres lecturas de este tipo para luego proceder a obtener un valor promedio. Se registra este valor, la fecha y hora de la medición.\n\nAdicionalmente se colocará una regleta a escala milimétrica (limnímetro) aguas arriba del vertedero en una de sus paredes o en una estructura independiente para realizar una medición visual de la altura del agua, la fecha y hora, durante cada descarga de datos o visita a la estructura. Este dato servirá para validar la información registrada por el sensor automático. La relación entre la altura registrada en la regleta (medida desde el vértice del vertedero hacia la superficie del agua) y el caudal aforado  anualmente permiten obtener la curva de descarga de la estructura hidráulica (vertedero), con lo cual la transformación de los niveles  registrados por los equipos automáticos en caudales puede ser estimada con mayor precisión durante los cálculos  computacionales. En caso de constatación de falla del sensor automático, esta curva de descarga podrá ser usada para la corrección de las mediciones."]
[]
[null,"7.- ESTIMACIÓN DE UNA SITUACIÓN CON PROYECTO Y SIN PROYECTO - EJEMPLOS DE APLICACIÓN"]
[]
[null,"Fase 1"]
[null,"En la cuenca del río Shullcas, se tiene el proyecto recuperación de la Jalca, ubicado en suelos de combinación de limo y arcilla, con pendiente características de 20 %, con una precipitación anual de 1013.70 mm y una estimación de evapotranspiración anual igual a 238.7 mm. el cual busca una recuperación de 20 hectáreas en la microcuenca de la laguna de Huacracocha."]
[]
[]
[null,"Fase 2"]
[]
[null,null,"1.- Estimación de la recarga potencial por infiltración",null,null,null,null,null,null,"Situación\nS/P","Situación\nC/P"]
[null,null,null,null,null,null,null,null,null,null,"C/P"]
[null,null,"Información:",null,null,null,null,null,"Unidades","Valor","Valor"]
[null,null,"Precipitación anual",null,null,null,null,null,"(mm/año)",1013.7,1013.7]
[null,null,"Evapotraspiración anual",null,null,null,null,null,"(mm/año)",238.66,238.66]
[null,null,"Balance climático (BC)",null,null,null,null,null,"(mm/año)",{"$f":"J195-J196","v":775.04000000000008},{"$f":"K195-K196","v":775.04000000000008}]
[null,null,"Tipo de ecosistema: Jalca"]
[null,null,"Kv",null,null,null,null,null,null,{"$f":"+H134","v":7.4999999999999997E-2},{"$f":"+G134","v":0.15}]
[null,null,"Kp",null,null,null,null,null,null,{"$f":"+G142","v":0.15},{"$f":"+J200","v":0.15}]
[null,null,"Ks",null,null,null,null,null,null,{"$f":"+G152","v":0.15},{"$f":"+J201","v":0.15}]
[null,null,"C= Kv+Kp+Ks",null,null,null,null,null,null,{"$f":"SUM(J199:J201)","v":0.375},{"$f":"SUM(K199:K201)","v":0.44999999999999996}]
[null,null,"Estimacion de la recarga potencial por Infiltración (S/P): BC*C",null,null,null,null,null,"(mm/año)",{"$f":"J197*J202","v":290.64000000000004}]
[null,null,"Intervención de 1 ha",null,null,null,null,null,"(m3/ha-año)",{"$f":"10*J203","v":2906.4000000000005}]
[null,null,"Recarga potencial por Infiltración (C/P): BC*C",null,null,null,null,null,"(mm/año)",null,{"$f":"K197*K202","v":348.76799999999997}]
[null,null,"Siendo área de intervención de 1 ha",null,null,null,null,null,"(m3/ha-año)",null,{"$f":"10*K205","v":3487.68}]
[]
[]
[]
[null,"Fase 3"]
[null,"Análisis de probabilidades para estimar el aporte al escurrimiento total, bajo un escenario conservador"]
[]
[]
[null,null,null,null,null,null,null,"S/P","C/P"]
[null,null,null,null,null,null,"(m3/año -ha)",{"$f":"+J204","v":2906.4000000000005},{"$f":"+K206","v":3487.68}]
[]
[null,null,null,null,"Caso 1",null,null,"S/P","C/P"]
[null,null,null,null,"Escenarios","Porcentaje ","Probabilidad","% de la recarga potencial por infiltración (m3/año -ha)","% de la recarga potencial por infiltración (m3/año -ha)"]
[null,null,null,null,"Muy bajo",0.2,{"$f":"1/3","v":0.33333333333333331},{"$f":"+H215*F219","v":581.28000000000009},{"$f":"+I215*F219","v":697.53600000000006}]
[null,null,null,null,"Bajo",0.3,{"$f":"1/3","v":0.33333333333333331},{"$f":"+H215*F220","v":871.92000000000019},{"$f":"+I215*F220","v":1046.3039999999999}]
[null,null,null,null,"Moderado",0.5,{"$f":"1/3","v":0.33333333333333331},{"$f":"+H215*F221","v":1453.2000000000003},{"$f":"+I215*F221","v":1743.84}]
[null,null,null,null,"Escurrimiento base (m3/año -ha)",null,null,{"$f":"SUMPRODUCT(G219:G221,H219:H221)","v":968.80000000000018},{"$f":"SUMPRODUCT(G219:G221,I219:I221)","v":1162.56}]
[]
[]
[null,null,null,null,"Caso 2",null,null,"S/P","C/P"]
[null,null,null,null,"Escenarios","Porcentaje ","Probabilidad","% de la recarga potencial por infiltración (m3/año -ha)","% de la recarga potencial por infiltración (m3/año -ha)"]
[null,null,null,null,"Muy bajo",0.2,{"$f":"2/3","v":0.66666666666666663},{"$f":"+H215*F227","v":581.28000000000009},{"$f":"+I215*F227","v":697.53600000000006}]
[null,null,null,null,"Bajo",0.3,{"$f":"1/3","v":0.33333333333333331},{"$f":"+H215*F228","v":871.92000000000019},{"$f":"+I215*F228","v":1046.3039999999999}]
[null,null,null,null,"Moderado",0.5,0,{"$f":"+H215*F229","v":1453.2000000000003},{"$f":"+I215*F229","v":1743.84}]
[null,null,null,null,"Escurrimiento base (m3/año -ha)",null,null,{"$f":"SUMPRODUCT(G227:G229,H227:H229)","v":678.16000000000008},{"$f":"SUMPRODUCT(G227:G229,I227:I229)","v":813.79199999999992}]
[]
[]
[null,null,null,null,"Caso 3",null,null,"S/P","C/P"]
[null,null,null,null,"Escenarios","Porcentaje ","Probabilidad","% de la recarga potencial por infiltración (m3/año -ha)","% de la recarga potencial por infiltración (m3/año -ha)"]
[null,null,null,null,"Muy bajo",0.2,0.33333333333333331,{"$f":"+$H$215*F235","v":581.28000000000009},{"$f":"+$I$215*F235","v":697.53600000000006}]
[null,null,null,null,"Bajo",0.3,0.66666666666666663,{"$f":"+$H$215*F236","v":871.92000000000019},{"$f":"+$I$215*F236","v":1046.3039999999999}]
[null,null,null,null,"Moderado",0.5,0,{"$f":"+$H$215*F237","v":1453.2000000000003},{"$f":"+$I$215*F237","v":1743.84}]
[null,null,null,null,"Escurrimiento base (m3/año -ha)",null,null,{"$f":"SUMPRODUCT(G235:G237,H235:H237)","v":775.04000000000008},{"$f":"SUMPRODUCT(G235:G237,I235:I237)","v":930.04799999999977}]
[]
[]
[null,null,null,null,"Caso 4",null,null,"S/P","C/P"]
[null,null,null,null,"Escenarios","Porcentaje ","Probabilidad","% de la recarga potencial por infiltración (m3/año -ha)","% de la recarga potencial por infiltración (m3/año -ha)"]
[null,null,null,null,"Muy bajo",0.2,0,{"$f":"+$H$215*F243","v":581.28000000000009},{"$f":"+$I$215*F243","v":697.53600000000006}]
[null,null,null,null,"Bajo",0.3,0.33333333333333331,{"$f":"+$H$215*F244","v":871.92000000000019},{"$f":"+$I$215*F244","v":1046.3039999999999}]
[null,null,null,null,"Moderado",0.5,0.66666666666666663,{"$f":"+$H$215*F245","v":1453.2000000000003},{"$f":"+$I$215*F245","v":1743.84}]
[null,null,null,null,"Escurrimiento base (m3/año -ha)",null,null,{"$f":"SUMPRODUCT(G243:G245,H243:H245)","v":1259.4400000000003},{"$f":"SUMPRODUCT(G243:G245,I243:I245)","v":1511.328}]
[]
[]
[null,null,null,null,"Caso 5",null,null,"S/P","C/P"]
[null,null,null,null,"Escenarios","Porcentaje ","Probabilidad","% de la recarga potencial por infiltración (m3/año -ha)","% de la recarga potencial por infiltración (m3/año -ha)"]
[null,null,null,null,"Muy bajo",0.2,0,{"$f":"+$H$215*F251","v":581.28000000000009},{"$f":"+$I$215*F251","v":697.53600000000006}]
[null,null,null,null,"Bajo",0.3,0.66666666666666663,{"$f":"+$H$215*F252","v":871.92000000000019},{"$f":"+$I$215*F252","v":1046.3039999999999}]
[null,null,null,null,"Moderado",0.5,0.33333333333333331,{"$f":"+H215*F253","v":1453.2000000000003},{"$f":"+$I$215*F253","v":1743.84}]
[null,null,null,null,"Escurrimiento base (m3/año -ha)",null,null,{"$f":"SUMPRODUCT(G251:G253,H251:H253)","v":1065.6800000000003},{"$f":"SUMPRODUCT(G251:G253,I251:I253)","v":1278.8159999999998}]
[]
[]
[null,null,null,null,"Caso 6",null,null,"S/P","C/P"]
[null,null,null,null,"Escenarios","Porcentaje ","Probabilidad","% de la recarga potencial por infiltración (m3/año -ha)","% de la recarga potencial por infiltración (m3/año -ha)"]
[null,null,null,null,"Muy bajo",0.2,0.66666666666666663,{"$f":"+$H$215*F259","v":581.28000000000009},{"$f":"+$I$215*F259","v":697.53600000000006}]
[null,null,null,null,"Bajo",0.3,0,{"$f":"+$H$215*F260","v":871.92000000000019},{"$f":"+$I$215*F260","v":1046.3039999999999}]
[null,null,null,null,"Moderado",0.5,0.33333333333333331,{"$f":"+$H$215*F261","v":1453.2000000000003},{"$f":"+$I$215*F261","v":1743.84}]
[null,null,null,null,"Escurrimiento base (m3/año -ha)",null,null,{"$f":"SUMPRODUCT(G259:G261,H259:H261)","v":871.92000000000007},{"$f":"SUMPRODUCT(G259:G261,I259:I261)","v":1046.3040000000001}]
[]
[]
[null,null,null,null,"Caso 7",null,null,"S/P","C/P"]
[null,null,null,null,"Escenarios","Porcentaje ","Probabilidad","% de la recarga potencial por infiltración (m3/año -ha)","% de la recarga potencial por infiltración (m3/año -ha)"]
[null,null,null,null,"Muy bajo",0.2,{"$f":"1/3","v":0.33333333333333331},{"$f":"+$H$215*F267","v":581.28000000000009},{"$f":"+$I$215*F267","v":697.53600000000006}]
[null,null,null,null,"Bajo",0.3,0,{"$f":"+$H$215*F268","v":871.92000000000019},{"$f":"+$I$215*F268","v":1046.3039999999999}]
[null,null,null,null,"Moderado",0.5,{"$f":"2/3","v":0.66666666666666663},{"$f":"+$H$215*F269","v":1453.2000000000003},{"$f":"+$I$215*F269","v":1743.84}]
[null,null,null,null,"Escurrimiento base (m3/año -ha)",null,null,{"$f":"SUMPRODUCT(G267:G269,H267:H269)","v":1162.5600000000002},{"$f":"SUMPRODUCT(G267:G269,I267:I269)","v":1395.0719999999999}]
[]
[]
[null,null,null,null,null,null,null,"Situación\nS/P","Situación\nC/P"]
[]
[null,null,null,null,null,null,"Casos","Escurrimiento base\n(m3/año-ha) ","Escurrimiento base\n(m3/año-ha) "]
[null,null,null,null,null,null,"Caso 1",{"$f":"+H222","v":968.80000000000018},{"$f":"+I222","v":1162.56}]
[null,null,null,null,null,null,"Caso 2",{"$f":"+H230","v":678.16000000000008},{"$f":"+I230","v":813.79199999999992}]
[null,null,null,null,null,null,"Caso 3",{"$f":"+H238","v":775.04000000000008},{"$f":"+I238","v":930.04799999999977}]
[null,null,null,null,null,null,"Caso 4",{"$f":"+H246","v":1259.4400000000003},{"$f":"+I246","v":1511.328}]
[null,null,null,null,null,null,"Caso 5",{"$f":"+H254","v":1065.6800000000003},{"$f":"+I254","v":1278.8159999999998}]
[null,null,null,null,null,null,"Caso 6",{"$f":"+H262","v":871.92000000000007},{"$f":"+I262","v":1046.3040000000001}]
[null,null,null,null,null,null,"Caso 7",{"$f":"+H270","v":1162.5600000000002},{"$f":"+I270","v":1395.0719999999999}]
[null,null,null,null,null,null,"Escurrimiento base que aporta al caudal total",{"$f":"AVERAGE(H276:H282)","v":968.80000000000018},{"$f":"AVERAGE(I276:I282)","v":1162.56}]
[]
[null,null,null,null,null,null,null,"Diferencial de situación S/P con C/P"]
[null,null,null,null,null,null,"Escurrimiento que aporta al caudal total",{"$f":"I283-H283","v":193.75999999999976},"m3/año-ha"]
[null,null,null,null,null,null,"Número de hectáreas recuperadas",20,"ha"]
[null,null,null,null,null,null,"Ganancia hídrica del proyecto",{"$f":"H287*H286","v":3875.1999999999953},"m3/año"]
[null,null,null,null,null,null,"Como el proyecto busca la recuperación de 20 ha, la ganancia hídrica que genera 3,875.2 m3/ha"]
[]
[null,"8.- BIBLIOGRAFÍA"]
[null,"• Aportes de las reuniones técnicas del MINAM.\n• Aranda, C. 1998. Procesos del ciclo hidrológico. ME. 550p.\n• Gómez S; Guzmán, J. 2011. Separación of the flow in upper part of the Lebrija river basin. CO.12p.\n• Junker, M. 2005. Método RAS para determinar la recarga de agua subterránea. FORGAES. SV.40p.\n• MINAM (Ministerio del Ambiente): Mapa Nacional de Ecosistemas del Perú. 121p.\n• Iniciativa Regional de Monitoreo Hidrológico de Ecosistemas Andinos. Guía metodológica para el monitoreo hidrológico de ecosistemas andinos – iMHEA, Versión 27 de Agosto de 2013. 22p.\n• Gómez S_ Guzmán, J. 2011. Separation of the flow in upper part of the Lebrija river basin"]

{"sheet":"INFRAESTRUCTURA NATURAL","index":42,"n_rows":308,"n_cols":8,"rows_kept":308,"cut":false,"hidden":false,"merged":[[288,6,288,7],[289,4,289,5],[289,6,289,7],[32,1,32,10],[33,1,33,10],[36,1,36,10],[37,1,37,10],[39,1,39,10],[40,1,40,10],[42,1,42,10],[128,1,128,10],[148,1,148,10],[113,1,113,10],[114,1,114,10],[116,1,116,10],[117,1,117,10],[119,1,119,10],[120,1,120,10],[122,1,122,10],[123,1,123,10],[127,1,127,10],[43,1,43,10],[45,1,45,10],[46,1,46,10],[18,1,18,10],[19,1,19,10],[20,1,20,10],[23,1,23,10],[24,1,24,10],[26,1,26,10],[27,1,27,10],[29,1,29,10],[30,1,30,10],[6,1,6,10],[7,1,7,10],[9,1,9,10],[10,1,10,10],[11,1,11,10],[12,1,12,10],[13,1,13,10],[14,1,14,10],[17,1,17,10],[47,1,47,10],[48,1,48,10],[51,1,51,10],[52,1,52,10],[80,1,80,10],[84,1,84,10],[53,1,53,10],[56,1,56,10],[57,1,57,10],[66,1,66,10],[67,1,67,10],[75,1,75,10],[78,1,78,10],[79,1,79,10],[86,1,86,10],[87,1,87,10],[68,2,68,3],[68,4,68,8],[72,2,73,3],[72,4,72,8],[73,4,73,8],[89,1,89,10],[90,1,90,10],[69,2,69,3],[69,4,69,8],[70,2,70,3],[70,4,70,8],[71,2,71,3],[71,4,71,8],[92,1,92,10],[93,1,93,10],[95,1,95,10],[96,1,96,10],[99,1,99,10],[100,1,100,10],[102,1,102,10],[103,1,103,10],[105,1,105,10],[171,1,171,10],[183,1,183,10],[184,1,184,10],[173,3,173,4],[173,5,173,6],[173,7,173,8],[174,3,174,4],[106,1,106,10],[108,1,108,10],[109,1,109,10],[161,1,161,10],[163,1,163,10],[164,1,164,10],[167,1,167,10],[168,1,168,10],[170,1,170,10],[149,1,149,10],[151,1,151,10],[152,1,152,10],[154,1,154,10],[155,1,155,10],[134,5,134,6],[134,7,134,8],[135,5,135,6],[135,7,135,8],[136,5,136,6],[136,7,136,8],[140,5,140,6],[140,7,140,8],[141,5,141,6],[137,5,137,6],[137,7,137,8],[138,5,138,6],[138,7,138,8],[139,5,139,6],[139,7,139,8],[174,5,174,6],[174,7,174,8],[195,17,195,19],[131,3,131,4],[131,5,131,6],[131,7,131,8],[132,3,136,4],[132,5,132,6],[132,7,132,8],[133,5,133,6],[133,7,133,8],[160,1,160,10],[192,1,192,10],[193,1,193,10],[141,7,141,8],[142,5,142,6],[142,7,142,8],[143,5,143,6],[143,7,143,8],[137,3,143,4],[186,1,186,10],[187,1,187,10],[189,1,189,10],[190,1,190,10],[231,1,231,10],[232,1,232,10],[233,1,233,10],[237,1,237,10],[196,1,196,10],[197,1,197,10],[199,1,199,10],[200,1,200,10],[202,1,202,10],[203,1,203,10],[238,1,238,10],[240,1,240,10],[177,3,177,4],[177,5,177,6],[177,7,177,8],[175,3,175,4],[175,5,175,6],[175,7,175,8],[176,3,176,4],[176,5,176,6],[176,7,176,8],[205,3,205,5],[205,6,205,7],[178,3,178,4],[178,5,178,6],[178,7,178,8],[179,3,179,4],[179,5,179,6],[179,7,179,8],[223,1,223,10],[224,1,224,10],[227,1,227,10],[228,1,228,10],[230,1,230,10],[241,1,241,10],[243,5,243,8],[244,5,244,8],[245,5,245,8],[246,5,246,8],[247,5,247,8],[248,5,248,8],[249,5,249,8],[250,5,250,8],[246,3,246,4],[247,3,247,4],[244,3,244,4],[243,3,243,4],[248,3,248,4],[249,3,249,4],[250,3,250,4],[256,1,256,10],[209,3,209,5],[209,6,209,7],[210,3,210,5],[210,6,210,7],[211,3,211,5],[211,6,211,7],[206,3,206,5],[206,6,206,7],[207,3,207,5],[207,6,207,7],[208,3,208,5],[208,6,208,7],[215,3,215,5],[215,6,215,7],[216,3,216,5],[216,6,216,7],[212,3,212,5],[212,6,212,7],[213,3,213,5],[213,6,213,7],[214,3,214,5],[214,6,214,7],[245,3,245,4],[257,1,257,10],[259,1,259,10],[260,1,260,10],[263,1,263,10],[265,1,265,10],[266,1,266,10],[269,1,269,10],[270,1,270,10],[272,1,272,10],[307,1,307,10],[273,1,273,10],[277,1,277,10],[278,1,278,10],[285,4,285,5],[285,6,285,7],[286,4,286,5],[286,6,286,7],[287,4,287,5],[287,6,287,7],[284,4,284,5],[284,6,284,7],[283,4,283,5],[283,6,283,7],[280,1,280,10],[281,1,281,10],[295,1,295,10],[296,1,296,10],[298,1,298,10],[299,1,299,10],[302,1,302,10],[303,1,303,10],[306,1,306,10],[288,4,288,5]]}
[]
[]
[]
[]
[]
[]
[null,"REVEGETACIÓN CON ESPECIES NATIVAS"]
[null,"Para determinar el área a revegetar, es recomendable el uso de imágenes satelitales representativas de la zona degradada para la realización de un análisis histórico comparativo del estado del ecosistema, en un rango aproximado de 10 a 30 años. Además, tener en cuenta los siguientes criterios:\n \nSegún la disponibilidad de la información, el formulador deberá establecer años representativos o subperíodos para realizar esta subactividad.\nLas imágenes deben garantizar el reconocimiento de los atributos del ecosistema: (i) florística del sitio (entre gramíneas, graminoides, leguminosas y otras especies herbáceas), (ii) estabilidad del suelo e (iii) integridad biótica. Esto implica asegurar que la actividad de reforestación facilite la heterogeneidad, integralidad y armonía entre los atributos.\nDe manera complementaria, realizar estudios de composición del suelo por tipo de ecosistema y las especies de cobertura vegetal predominantes.\nSe podría incluir hasta un 10% de especies exóticas como parte de la sostenibilidad de la revegetación.\n \nEste proceso se debe aplicar para todo tipo de ecosistema."]
[]
[null,"Siembra de especies herbáceas seleccionados"]
[null,"Temporalidad de la intervención\nLa siembra de especies herbáceas se realiza principalmente durante la época de estiaje. Además, a manera de recomendación se debe sembrar inmediatamente después de una semana seguida de lluvias, que puede ser desde la segunda quincena de diciembre hasta los primeros quince días de enero. No se recomienda siembras en febrero.\n \nSin embargo, la temporalidad dependerá del tipo de ecosistema y la especie seleccionada."]
[null,"Localización del área a revegetar\nPara realizar la elección del terreno se debe tener en cuenta las siguientes condiciones: · \n- Que el terreno cuente con disponibilidad de agua todo el año, para poder realizar riegos oportunos y tener buena producción de pastos. \n- Suelos con buen drenaje, es decir, que no sean oconales o presenten charcos de agua. \n- Suelo profundo y no rocoso. \n- Terreno de preferencia plano o con ligera pendiente (no mayor a 3%, caso contrario intentar nivelarlo). \n- Una vez elegido el terreno se debe realizar el muestreo de suelo para su respectivo análisis en el laboratorio; según el resultado se realiza la programación de la cantidad de fertilizantes a emplear. Así, se obtiene el pH o nivel de acidez o salinidad del suelo.\n- Un suelo óptimo para los cultivos son los que presentan un pH neutro, eso significa que no es salino ni tampoco ácido. Considerar que la mayoría de los suelos de la sierra son relativamente ácidos."]
[null,"Preparación del terreno\nLa preparación del terreno significa realizar diferentes actividades como: roturado del terreno, cruza, desterroneo, cantoneo, nivelación y melgueo; con la finalidad que la semilla de los pastos tenga buena germinación y de esa manera tener buena cobertura y producción de pastos."]
[null,"Selección del sistema de siembra\nUna vez preparado el terreno, según la disponibilidad de mano de obra y el tipo de especie seleccionada se pueden realizar los siguientes sistemas de siembra:\n \nSiembra al Voleo: Se realiza a mano dejando caer la semilla en forma constante y uniforme; es importante tener en cuenta la dirección del viento.\nSiembra en Líneas: Se realiza a mano, utilizando surcos o meglas que se hacen previamente o con el uso de yunta.\nSiembra Mecánica: Se realiza utilizando sembradora traccionada por tractor.\nA manera de recomendación, debido a la mayor infiltración del agua y mejor distribución de la cobertura vegetal, se recomienda la siembra a partir de un sistema de líneas."]
[null,"Plantación de esquejes\nEn caso se use sistemas de plantación de esquejes mediante líneas, considerar:\n \nSistema por surcos: Se recomienda un distanciamiento de 40 cm entre surcos y 30 cm entre esquejes en promedio. \nSistema de melgas: Se recomienda una distancia de 40 cm entre líneas y a 30 cm entre esquejes. \n \nA manera preliminar, la irrigación del terreno debe ser inmediatamente luego de terminar con la instalación (considerar mantener el suelo húmedo). Además, considerar realizar esta actividad al inicio de la temporada de lluvias para facilitar el prendimiento y reducir el costo de mano de obra en irrigación."]
[]
[]
[null,"Labores culturales a pastizales"]
[null,"Riego\nTemporalidad de la actividad: \nEs necesario contar con agua durante todo el año, más aún durante los periodos de estiaje. \nSi las lluvias son irregulares, inclusive, se deben hacer riegos intensivos (bajo el sistema que correspondiera a la intervención), en un periodo de 8 días durante los primeros dos meses. Posterior a la plantación de esquejes, el riego debe hacerse cada 15 días durante el primer año de instalación. En periodos posteriores se pueden distanciar más las fechas de riego."]
[null,"Deshierbe\nEsta actividad consiste en la eliminación de malezas que compiten por agua, nutrientes, luz, espacio, entre otras. Para su realización, se considera el empleo de carretilla, picota, palana e instrumentos de uso manual. \n \nEsta actividad debe complementarse con el uso de cercos (con alambres o mallas protectoras) frente a actividades de sobrepastoreo en épocas de estiaje."]
[null,"Revisión de raíces\nEs necesario revisar las raíces de la plantación para asegurar que se encuentran captando de manera adecuada el agua y el abono utilizado. En caso existan raíces en mal estado que puedan comprometer al crecimiento del pastizal, se las debe podar mediante el uso de una pequeña tijera."]
[]
[]
[null,"INSTALACIÓN DE CERCOS EXCLUIDORES"]
[null,"Para determinar el área a proteger, es recomendable el uso de imágenes satelitales representativas de la zona degradada para la realización de un análisis histórico comparativo del estado del ecosistema, en un rango aproximado de 10 a 30 años. Además, tener en cuenta los siguientes criterios:\n \n- Según la disponibilidad de la información, el formulador deberá establecer años representativos o sub-períodos para realizar esta sub-actividad.\n- Las imágenes deben garantizar el reconocimiento de los atributos del ecosistema: (i) florística del sitio, (ii) estabilidad del suelo e (iii) integridad biótica. Esto implica asegurar que la actividad de reforestación facilite la heterogeneidad, integralidad y armonía entre los atributos."]
[]
[null,"Trazo y marcación"]
[null,"Para el trazado y marcación del terreno se recomienda:\n- Considerar las características topográfica y la fisiografía de la zona andina a intervenir. \n- La marcación del espacio, considera una separación entre marcas de 5 metros. A partir de esto, el espacio a cubrir es medido por el número de marcas por Km."]
[]
[null,"Apertura de hoyos"]
[null,"Esta actividad se mide por la cantidad de hoyos aperturados por jornal en el día. Considerar los siguientes criterios técnicos:\n \n- Apertura de hoyos en un espacio cuadrado que ronda los 20 cm por lado y 50 cm de profundidad de manera estándar, es decir, superar la capa orgánica del suelo de aproximadamente 20 cm hasta llegar al subsuelo. \n- Considerar que los hoyos de las esquinas del terreno deben tener mayores dimensiones: 40 cm de diámetro y entre 60 y 70 cm de profundidad. \n \nIndumentaria a usar: Ambos puntos requieren el uso de palana, carretilla y piqueta."]
[]
[null,"Traslado y plantado de postes"]
[null,"Para el traslado e instalación de postes de madera, se deberá considerar los siguientes criterios: \n\nCondiciones de acceso hacia cada zona\n- En caso no existan rutas pavimentadas, el trabajo de traslado se realizará mediante el uso de animales de carga, o de vehículos para el transporte de mayor cantidad de postes. \n- Este trabajo debe hacerse en colaboración con los comuneros de la zona, por lo que la unidad de medida a considerar es el número de postes trasladados por jornal.\n \nIndumentaria a usar \n- Postes rollizos de madera o de otro material, preservados con tratamiento de brea en la base. \n- Las dimensiones de estos postes debe ser de 4\" de grosor, por 2 metros de largo. \n- Se sugiere el uso de piedra, adobe, tapiales o champas. Además de mallas ganaderas de alambre (9 a 10 hilos), filas de alambre galvanizado, de alambre de púa, con geo mallas, entre otros.\n \nInstalación de malla ganadera\n- Enterrar la base cubierta de brea (se recomienda 3 bloques de brea) de los postes de madera a 80 cm de profundidad, a un distanciamiento entre 5 y 7 metros.\n- Colocar los rollos de malla ganadera alrededor de los postes instalados. La altura de la malla ganadera deberá ser aproximadamente de 0.9 m.\n- Usar las grapas para poder fijar la malla a la madera (grapas de 1.5 pulgadas).\n- Usar piedras o cemento para las esquinas y brindar estabilidad al cerco.\n- Usar sogas y un tensador.\n \nRecomendaciones adicionales\nSe recomienda colocar piedras para garantizar su estabilización y evitar rellenar el espacio faltante con tierra para prevenir la podredumbre de la madera. Los postes deben de colocarse en hileras rectas considerando el distanciamiento de marcación realizados con anterioridad."]
[]
[]
[null,"REFORESTACIÓN CON ESPECIES NATIVAS"]
[null,"La reforestación consiste en repoblar zonas que en el pasado histórico reciente estaban cubiertas por bosques que han sido eliminados por diversos motivos: explotación de la madera para fines industriales o para consumo como plantas, ampliación de la frontera agrícola o ganadera, ampliación de áreas urbanas e incendios forestales."]
[]
[null,"Criterios Generales"]
[null,"Análisis histórico\nPara determinar el área a restaurar, es recomendable el uso de imágenes satelitales representativas de la zona degradada para la realización de un análisis histórico comparativo del estado del ecosistema, en un rango aproximado de 10 a 30 años. Además, tener en cuenta los siguientes criterios:\n\n- Según la disponibilidad de la información, el formulador deberá establecer años representativos o subperíodos para realizar esta subactividad.\n- Las imágenes deben garantizar el reconocimiento de los atributos del ecosistema: (i) florística del sitio (árboles y arbustos), (ii) estabilidad del suelo e (iii) integridad biótica. Esto implica asegurar que la actividad de reforestación facilite la heterogeneidad, integralidad y armonía entre los atributos.\n- De manera complementaria, realizar estudios de composición del suelo por tipo de ecosistema y las especies de cobertura vegetal predominantes.\n\nReconocimiento del tipo de ecosistema\nEn zonas andinas, los cinco ecosistemas son:\n\n- Bosque relicto altoandino (queñoal y otros)\n- Bosque relicto montano de vertiente occidental \n- Bosque relicto mesoandino\n- Bosque estacionalmente seco interandino (Marañón, Mantaro, Pampas y Apurímac).\n- Matorral andino.\n\nAdemás, esta actividad se realizará tomando en cuenta las siguientes consideraciones: (i) exposición solar, pues hacia el hemisferio sur las laderas con dirección norte reciben mayor exposición solar. Por lo tanto, preferentemente se deben ubicar las plantaciones en laderas con exposición sur, las cuales son más húmedas; y (ii) el rango altitudinal y pendiente por especie."]
[]
[null,"Planificación de especies a adquirir o producir"]
[null,"Definición\nLa planificación de especies es una actividad que involucra determinar la cantidad de especies a instalar en terreno definitivo, según el tipo de ecosistema , ya sea a partir de la producción o adquisición de plantones.\n\nConsideraciones\nEn zonas andinas las consideraciones son:\n\n- Localización del proyecto, su objetivo y las propiedades en el uso de cada especie forestal (árboles y arbustos) que contribuyan a lograrlo. \n- Requerimiento de agua y luz solar de la especie.\n- Tipo de suelo y pendiente del terreno, en la cual se desarrolla.\n- Densidad de plantación por especie, según sus características de crecimiento y requerimientos de recursos adicionales.\n- Costos asociados por transporte de la especie, hacia el lugar donde se realizará la plantación.\n- Tiempo de siembra de los plantones"]
[]
[null,"Implementación de viveros forestales"]
[null,"Definición\nEl vivero es un ambiente, cuyo objetivo es albergar y producir un número determinado de plantones para su posterior uso en las actividades de plantación. Estos pueden clasificarse según su uso y según su temporalidad:\n\nSegún su uso: viveros forestales, viveros para ornamentación, viveros de investigación y viveros de frutales.\nSegún temporalidad: volantes o temporales y fijos o permanentes. Los viveros temporales son mayormente empleados para la producción de especies forestales y frutales, mientras que los permanentes para plantas ornamentales u hortalizas.\n\nLocalización\nDe manera referencial, se establecen los siguientes criterios para la localización del vivero:\n\n- Cada vivero debe instalarse lo más cerca del área de plantación final, para evitar cambios bruscos en el ambiente y afianzar la adaptabilidad de la especie.\n- El vivero debe ser de fácil acceso y cercano a vías de fácil tránsito en el área de ejecución.\n- El recinto debe tener disponibilidad de agua durante todo el proceso de producción de plantones, principalmente en periodos secos o de estiaje.\n- El recurso hídrico empleado no debe estar contaminado, libre de agentes patógenos y residuos de productos químicos usados en actividades agropecuarias.\n- La zona de intervención es preferible que sea de topografía plana o pendiente muy suave, no mayor a 3% de inclinación con la finalidad de lograr el escurrimiento de las aguas de lluvia y evitar la formación de charcos durante estas.\n- Cesión en uso: Se debe coordinar con la comunidad explicando las oportunidades del vivero en la comunidad y la necesidad de ubicarlo en dicha zona."]
[null,"Tamaño\nEl tamaño del vivero depende directamente de la capacidad de plantones a producir. Así, se tienen las siguientes características:\n- Camas de germinación: El tamaño de las camas de germinación o almacenamiento se recomienda tenga una medida de 1.20m de ancho y 5m de largo . Este tamaño estándar es usado para la producción de 1,000 plantones, en su etapa de plántula. Además, cada cama de repique estará distanciada por 0.6m.\n- Perímetro de protección: \n    o El perímetro del vivero será cercado con madera rolliza u otro material, como mallas para cercos.\n    o Los postes para la delimitación del perímetro tendrán un distanciamiento de 2.0 m entre postes y se instalará alambre de púas para su protección.\n- Espacios complementarios: El vivero debe contar con dos espacios, uno para la preparación de sustratos y una zona de acondicionamiento de plantones para transporte. \n\nProcedimiento para la instalación del vivero\nPara iniciar con la instalación del vivero se deben seguir los siguientes pasos:\n\n1. Limpieza del terreno, a partir de la remoción de maleza, piedras, troncos u otros obstáculos.\n2. Mantener aquella vegetación que sirva como sombra natural o de soporte para las especies que lo requieran.\n3. Nivelar el terreno para hacerla plana, con una ligera inclinación de hasta 3%.\n4. Orientar la posición de las camas de repique de este a oeste para favorecer la entrada de la luz solar por mayor tiempo.\n5. Desinfectar el suelo.\n6. Instalación de canales de filtración de agua.\n7. Para el techo o tinglado del vivero se recomienda el uso de mallas de protección transparentes que permitan la entrada de luz solar y mantengan la humedad y la temperatura del ambiente."]
[null,"Materiales de construcción generales y tecnología a emplear:\n- Sistema de riego (nebulización, microaspersión)\n- Almacigueras\n- Invernaderos \n- Sustratos.\n- Materiales de aislamiento (postes, cemento, ladrillos, alambres, plásticos o mallas de aislamiento)."]
[]
[]
[null,"Labores culturales en producción de plantones"]
[null,"Preparación del sustrato\nEl sustrato orgánico se entiende como la mezcla de suelo (tierra negra), arena y materia orgánica (estiércol de ganado vacuno, carnero, gallinaza, humus, compost, entre otros) que se usa para llenar las bolsas en el vivero para la producción de plantones. Este también puede ser combinado en proporciones mínimas con cal u otro material que minimice los niveles de salinidad y acidez del suelo. Esto dependerá de la disponibilidad de materiales en la zona.\n \nCriterio técnico sugerido: \n- La muestra comúnmente utilizada en semilleros o germinadores es una relación de 1 a 3 para materia orgánica o compost (30%) y tierra o arena cernida (70%), respectivamente. Es decir, una carretilla de materia orgánica y tres carretillas de arena.\n- En el caso de bolsas de almacigo o tubetes, la relación es de 1 a 2, o una carretilla de materia orgánica y dos de arena. \n- Adicionalmente, se recomienda agregar 6 kg de cal para disminuir los niveles de acidez.\n- Considerar su desinfección mediante uso de agua hirviendo y algún material que ahisle el calor (puede ser la propia bolsa de almacigo), previa siembra de semillas.\n\nPasos para la siembra de semillas (almacigado)\nSe debe tener en cuenta las siguientes consideraciones:\n \n- Se hacen hoyos para el sembrío, cuyo tamaño ronda los 1.5 y 2 cm en promedio.\n- Las semillas deben estar previamente escarificadas y bien espaciadas entre sí (3 - 4 cm una de otra) en cada bolsa.\n- Se siembra las semillas con el micrópilo (orificio que se obtiene mediante la escarificación) hacia abajo, puesto que esto facilita la germinación de la planta, ya que tiene germinación epigea.\n- Se cubre las semillas (presionarlo ligeramente) con el mismo sustrato usado para llenar las bolsas.\nPor último, se riega el sustrato después de la siembra."]
[null,"Repique de plántula\nEl proceso de repique consiste en la separación y trasplante de plántulas en bolsas de almacigo, según las condiciones de agua y abonamiento para la misma especie. Algunas recomendaciones a considerar son:\n\n- Plántulas en mal estado: En caso en una bolsa no germine ninguna de las 2 semillas sembradas, se debe repicar una plántula sana de alguna bolsa de almacigo que tenga 2 plántulas de la misma especie y hacer el trasplante respectivo. \n- Plántulas sin germinar: Retirar o remover las plántulas más pequeñas de las bolsas donde han permanecido sin germinar, teniendo cuidado de no dañar la plántula nueva.\n\nControl fitosanitario\nAproximadamente durante el primer mes y medio de crecimiento de las plántulas, se las debe regar 1 vez cada 10 días en promedio por especie, con una solución controladora de hongos, evitándose con esto problemas de chupadera fungosa, enfermedad muy común en viveros de forestales. En caso de presentarse plagas (insectos), se recomienda  utilizar un tipo de agente para control de estos eventos.\n\nRiego\n- Indumentaria usada: La acción de riego se realiza usando la regadera o una manguera con un aspersor en su extremo final.\n- Temporalidad de la intervención: Cada 3 o 4 días durante el primer mes y medio, y luego cada vez que sea necesario según las condiciones climáticas (aproximadamente cada semana).\n\nDeshierbos y remoción de sustrato\nTemporalidad de la intervención: Los deshierbos deben realizarse cada vez que se considere necesario. Se recomienda realizarlo cada mes y medio, evitándose con esta práctica la posible competencia entre las malas hierbas y el plantón. \n\nActividades complementarias: \n- Regar el cultivo con una hora de anticipación al deshierbo.\n- Remoción del sustrato superficial de las bolsas (con los dedos), con la finalidad de que se rompan las probables capas duras de tierra que puedan existir, y así el agua de riego pueda penetrar libre y rápidamente en todo el sustrato de la bolsa. \n- Control de plantas invasoras."]
[]
[]
[null,"Plantación propiamente dicha"]
[null,"Tipo de plantación\n\n- Con base en el ecosistema utilizado\n\nPlantación en macizo: Este sistema es el más utilizado, consiste en la siembra de plantones en sitios de baja cobertura vegetal y arbustiva. Con ello, las especies plantadas se vuelven en las dominantes del sitio. \n\nPlantación de enriquecimiento: Con versatilidad para ser usada en fajas, parcelas o en claros. Esta plantación se realiza con el objetivo de recuperar el valor comercial de los bosques naturales. Estas plantaciones se realizan dentro del bosque buscando áreas desprovistas de cobertura vegetal. \n\nPlantación de enriquecimiento con manejo de la regeneración natural: Además de incorporar especies en campos descubiertos dentro de los bosques, la regeneración natural pretende eliminar otras especies que compitan y pongan en riesgo a la especie plantada.\n\n- Con base a la composición de especies\n\nPlantación pura o mono específica: Son aquellas que usan solo una especie.\n\nPlantación mixta: Incluyen dos o más especies en un mismo espacio geográfico, con el objetivo de proveer diferentes productos forestales y complementar el rendimiento y regeneración entre especies.\n\nSistema de plantación\nLuego, según el tipo de plantación, es necesario establecer el distanciamiento entre plantones en campo definitivo y sus principales efectos. De manera general, en el cuadro Nº 5, se detalla la propuesta de la guía sobre el sistema de plantación a seguir, con su respectivo porcentaje de merma o plantones a replantar:"]
[]
[null,null,null,null,"Distanciamiento o sistema de plantación (mxm)","Plantones por hectárea","Mortalidad aceptable (%)","Número de plantones a replantar"]
[null,null,null,null,"3.0x3.0",1.111,0.2,257]
[null,null,null,null,"3.5x3.5",816,0.15,141]
[null,null,null,null,"4.0x4.0",625,0.1,72]
[null,null,null,null,"5.0x5.0",400,0.05,23]
[]
[]
[null,"El distanciamiento de plantones también va a estar en función del diseño de la plantación:\n \nDiseño cuadrangular: utilizados en terrenos planos.\nDiseño a tres bolillo: utilizados en terrenos de pendiente pronunciada o para formaciones vegetales usadas como cortinas rompevientos.\nDiseño en curvas de nivel: utilizados en terrenos de pendientes pronunciadas principalmente, con fines de control de la erosión.\n \nAun así, la distribución de especies nativas por tipo de ecosistema es altamente heterogénea, por lo que se sugiere tomar la información del cuadro Nº 5 de manera referencial. Además, se sugiere tomar en cuenta que, a mayor distanciamiento de plantones, las labores culturales como deshierbo y control de plantas invasoras, así como los requerimientos de agua en la plantación son mayores."]
[null,"Hoyación\nA manera de referencia se sugiere revisar lo realizado por FONAM (2007). Luego del trazado de líneas de instalación, según el formato optado, y la delimitación de la cantidad óptima de plantones, se procede a la apertura de los hoyos."]
[null,null,"Características",null,"Descripción"]
[null,null,"Materiales a usar",null,"Picos, palas y barretas."]
[null,null,"Diseño",null,"La apertura de hoyos para forestales se realizará a una profundidad de 0.5 m y un diámetro de 0.4 m."]
[null,null,"Duración de actividad",null,"Para aprovechar la infiltración del agua en las primeras lluvias, el trabajo deberá realizarse entre los meses de octubre y diciembre."]
[null,null,"Recomendaciones",null,"Los hoyos deben ser dos veces más anchos y dos veces más hondos que la bolsa (en caso se utilice una plantación con este método)."]
[null,null,null,null,"Las dimensiones promedio de los hoyos son: 40 cm x 40 cm x 40 cm."]
[]
[null,"Establecimiento de la plantación\nA continuación, se presentan los pasos generales y recomendados para el establecimiento de la plantación en terreno definitivo:\n \nPrimer paso: colocar en la base la parte con contenido de materia orgánica. \nSegundo paso: quitar la bolsa del plantón y colocar la planta de forma vertical en la parte central del agujero, llenando el contorno del hoyo con la otra parte de tierra que servirá́ de sostén para la planta. \nTercer paso: se afirma la tierra para que quede compactada. \n\nRecomendaciones adicionales: \n- Dejar un espacio de 2 a 3 cm entre la superficie del hoyo y la del terreno para facilitar la captación del agua. \n- Mantener siempre el terreno húmero, más aún en épocas de estiaje y, en el caso de exposición solar prolongada, evitar sobreexponer las raíces por periodos largos de tiempo, al momento de la plantación.\n- Se podría incluir hasta un 10% de especies exóticas como parte de la sostenibilidad reforestación. Esta subactividad dependerá del tipo de ecosistema y de la especie empleada."]
[]
[]
[null,"Labores culturales a plantones establecidos"]
[null,"Después de realizar la plantación se debe manejar y proteger, para generar beneficios a largo plazo. Así, se recomienda tomar en cuenta que el crecimiento del plantón, independientemente de la especie, está en un rango entre 6 y 8 meses de establecida la plantación. Luego, la mayor parte de proyectos revisados evalúan la ejecución de sus metas físicas en un periodo de 3 a 4 años.\n\nEntre las principales subactividades culturales a realizar se encuentran:\n\nRiego\nDependiendo de la ubicación y la extensión de las temporadas de lluvia/sequía, para realizar esta subactividad se debe considerar las siguientes recomendaciones:\n \n- Regar en los meses de febrero, marzo y abril.\n- Aplicar entre 4 y 5 litros de agua por planta y según el tipo de reforestación. Esto puede variar según las necesidades de la especie.\n- La aplicación debe hacerse con cuidado y lentamente para no descubrir las raíces. Además, se debe permitir la absorción del agua por parte del suelo.\n- Optar, según las condiciones del terreno, el tipo de plantación y las especies utilizadas el tipo de riego: por goteo, por gravedad, con pivotes, entre otros.\n\nControl de plantas invasoras\nEs importante realizar el control de maleza, previa instalación de la plantación, para que sean tan solo los árboles los que aprovechen la humedad. \n \nTemporalidad de la intervención: \n- Su frecuencia varía según la rapidez del crecimiento de la maleza. Se recomienda, dependiendo de la zona, realizarse al menos los dos o tres primeros años de instalada la plantación. \n- En el caso de deshierbo, se hacen en dos épocas en particular: (i) en época lluviosa, cuando las malezas crecen agresivamente, y rápidamente cubren los árboles deformándolos o matándolos; y (ii) al final de las lluvias, ya que así́ los árboles inician la época de sequia sin competencia."]
[null,"Replante\nEl replante se debe realizar cuando exista entre el 10% y 20% de mortandad entre los plantones. Normalmente, este se realiza entre 30 y 40 días de haber establecido la plantación, nunca después de un año. Es necesaria la selección de plantas más resistentes y las especies adecuadas, según el tipo de plantación, para la ejecución de esta actividad.\n\nRaleo\nEs importante reconocer los siguientes criterios para realizar la subactividad:\n- Cuando las copas de los árboles son muy pequeñas y sus ramas chocan entre si.\n- Cuando existan plantones enfermos, defectuosos y mal formados.\n- Cuando exista poca penetración de luz solar.\n\nSe recomienda realizar el raleo cuando los plantones posean una altura entre 7m y 9m. Así, el primer raleo deberá realizarse al primer año de instalada la plantación y así sucesivamente cada dos años.\n\nPoda\nLa poda tiene como finalidad la eliminación de las ramas para lograr obtener madera libre de nudos y de calidad. \n \nIndumentaria usada: Esta se realiza con la ayuda de serruchos (ramas de 4 a 5 cm de diámetro), sierras y machetes bien afilados. Utilizando el machete se hace en dos cortes, el primer corte se hace de abajo hacia arriba para evitar que el peso de la rama raje la corteza, y el segundo de arriba hacia abajo para dejar liso el corte."]
[]
[]
[]
[null,"ENRIQUECIMIENTO DE SUELOS"]
[]
[null,"Deshierbo"]
[null,"Consiste en la eliminación de plantas que son esquilmantes. En el caso de pasturas naturales, las especies como el garbancillo, pacu pacu, waracco, kunkuna macho y pesq'e pesq'e, son indeseables porque, además de ser poco apetecibles, contienen sustancias físicas y químicas que inhiben la digestión de las plantas deseables. Su presencia en cantidades abundantes (más de 30 %) indica que el estado de salud del pastizal se ha deteriorado y que hay que iniciar un programa de control.\n \nEn las praderas que vienen siendo invadidas por especies indeseables, se deben realizar faenas comunales para eliminarla, de optar por esta práctica se deberá resembrar pastos naturales en los espacios de suelo que queden desnudos."]
[]
[null,"Abonamiento por fuentes minerales"]
[null,"Es la fertilización del suelo mediante el uso de fuentes minerales como: cenizas, cal, entre otras. Esto se dará principalmente en suelos con una alta acidez o alto ph. Se recomienda que estos fertilizantes deben ser incorporados durante las operaciones de labranza, en los sistemas de labranza de conservación, en los pastizales y las praderas, antes del establecimiento del cultivo. Es preciso indicar que la aplicación de cal agrícola durante el otoño, tendrá suficiente tiempo para reaccionar con la humedad del suelo y reducir la acidez antes de la siembra de los cultivos de marzo a junio. Asimismo, se recomienda combinar la cal con estiércol en una dosis de medio kilo de cal por cada 100kg de estiércol y humedecer con agua y dejar madurar entre 15 y 20 días, haciendo rotación a la mezcla cada 3 días."]
[]
[null,"Abonamiento orgánico del área"]
[null,"Es la incorporación de materia orgánica a la cobertura vegetal, mediante la distribución uniforme del guano de los dormideros de alpacas, ovinos y vacunos. Con el abonamiento se realizan dos acciones que favorecen la recuperación de las pasturas naturales: (i) devolver los nutrientes orgánicos al suelo, considerando que los suelos altoandinos son pobres en materia orgánica, nitrógeno, fósforo, potasio y micro elementos; (ii) desarrollar la práctica de revegetar las áreas de suelo desnudo, con la germinación de las semillas de pastos palatables que se encuentran en el sustrato. \n \nAlgunas recomendaciones para realizar esta actividad son:\n \n- Facilidad de acceso a dormideros portátiles o centros de abastecimiento de sustrato/abono. \n- Aplicación del guano a las zonas adyacentes a los canales de riego para favorecer la rápida descomposición, traslado, liberación de nutrientes y germinación de las semillas. Esta actividad se debe hacer luego del pastoreo rotativo.\n- El abonamiento debe realizarse en zonas de suelo desnudo o de escasa vegetación. Para ello, se recomienda remover parte de la materia orgánica del suelo, en huecos de 0.20 a 0.30 cm, e instalar el estiércol con la semilla. La dosis de estiércol por ha viene a ser entre 4000 y 6000 kg, distribuyéndolo al voleo por todo el pastizal.\n- Se debe depositar estiércol fresco.\n- Esta actividad deberá considerar las épocas de lluvias más cercanas (noviembre-diciembre)."]
[]
[null,"Instalación de vegetación para enriquecimiento del suelo"]
[null,"Este proceso de enriquecimiento complementa el proceso de revegetación, donde pueden ser usadas diferentes especies herbáceas y arbustivas, ricas en provisión de nitrógeno para enriquecer el suelo. Para la selección de especies, es necesario considerar las especies con mayores rizobios presentes en sus nódulos radiculares. Son estas bacterias y su mayor presencia en la plantación lo que permitirá la fijación del nitrógeno en el campo. Por lo mismo, es necesario que como parte de las labores culturales se garantice una eficiente nodulación.\n\nCriterios técnicos\n- El crecimiento de los nódulos depende en gran medida del tipo de suelo. Así, en suelos sólidos habrá una nodulación rápida con un tiempo estimado entre 5 y 7 días. Por otro lado, para suelos arcillosos, la nodulación demorará un máximo de 12 días. \n- La temperatura del ambiente debe estar entre 29ºC y 31ºC y tener un nivel de acidez recomendado inferior 5 de ph."]
[]
[]
[null,"REPARACIÓN DEL CANAL AMUNADOR"]
[null,"Las amunas son canales que infiltran el agua de lluvia y recargan los acuíferos. Los reservorios regulados incrementan la disponibilidad hídrica en la cuenca para la recuperación del ecosistema y de apoyo a la provisión el servicio ecosistémico de regulación hídrica.\n\nCriterios generales\nComo paso previo a la intervención, es necesaria la identificación de los sistemas de amunas o canales articulados a los tipos de ecosistema a atender. Para ello, se recomienda formular estudios básicos que involucren la identificación de la geomorfología de la zona (tipo de suelos, pendientes), fuentes hídricas aledañas y la situación de los canales, según sus niveles de erosión."]
[]
[null,"Construcción de dique y estructura de captación"]
[null,"Para poder proteger a la amuna de la erosión del suelo por las altas precipitaciones y lograr una mayor infiltración del agua, así como controlar la escorrentía del suelo, se sugiere la construcción de una represa de derivación (dique) y estructura de captación. La presa es con muro de tierra y núcleo de concreto protegido con concreto ciclópeo tipo enrocado, ubicada en una quebrada con toma de captación y desarenador, para la captación de aguas pluviales.\n \nLuego, para el caso de la estructura de captación, se determina hacia el final de la amuna, una quebrada donde se entrega el agua para que esta infiltre. Mayormente es una zona de roca fracturada con buena capacidad de infiltración y conductividad hidráulica. También puede ser una zona adecuadamente protegida para una nueva captación y almacenamiento superficial."]
[]
[null,"Mejoramiento de canal amunador"]
[null,"A partir de los estudios y la identificación del canal amunadora, se debe instalar un sistema de conducción para el recurso hídrico. En la experiencia de Tupichocha fueron tuberías de polietileno de alta densidad, ubicados en la parte alta a la cabera de chacra para su distribución mediante compuertas laterales."]
[]
[null,"Instalación de área de protección"]
[null,"Se recomienda la instalación de pastos y bosques en la cabecera de la quebrada, con el fin de disminuir el escurrimiento del agua. Esta actividad debe realizarse ante de la temporada de lluvias y debe ser complementada con estrategias de protección contra el sobrepastoreo."]
[]
[]
[]
[null,"REPARACIÓN DEL CANAL DE MAMANTEO"]
[null,"El mamanteo es una técnica que consiste en derivar el agua de las quebradas a través de canales y verterlas en suelos con alta capacidad de infiltración. Esta práctica busca aumentar la infiltración del agua en el suelo, durante la época de lluvia; para que durante la época de sequia, el agua infiltrada resurja en los manantiales. Además, esta acción permite la recuperación de ecosistemas degradados por falta de agua, sean pajonales, bofedales, entre otros y apoya a la provisión el servicio ecosistémico de regulación hídrica.\n\nCriterios generales\nComo paso previo a la intervención, es necesaria la identificación de los canales de mamanteo articulados a los tipos de ecosistema a atender. Para ello, se recomienda formular estudios básicos que involucren la identificación de la geomorfología de la zona (tipo de suelos, pendientes), fuentes hídricas aledañas y la situación de los canales, según sus niveles de erosión."]
[]
[null,"Descolmatación de canales"]
[null,"A partir de la determinación de la extensión de los canales de mamanteo, se sugiere realizar la limpieza o descolmatación de sedimentos y residuos que se encuentren en su recorrido. Para ello, se recomienda la coacción con los comuneros y el uso de palanas y carretillas o animales de carga para el transporte de estos desechos."]
[]
[null,"Reconstrucción e impermeabilización de canales de mamanteo"]
[null,"Se construye una captación al inicio de cada canal de mamanteo con la finalidad de aumentar la cantidad de volumen que ingresa a los canales. Luego, se impermeabiliza las primeras secciones de los canales, con la finalidad de asegurar que la mayor cantidad de agua que es conducida por el canal para llegar a la zona de infiltración, lo que se significa mayor cantidad de agua infiltrada y mayor cantidad de agua en los manantiales."]
[]
[null,"Instalación de medidas de protección"]
[null,"Se hace necesario proteger los canales de mamanteo, a partir de la instalación de cobertura vegetal en cabecera de cuenca. Con ello, se logra una disminución en la escorrentía y en la acumulación de sedimentos. Para realizar esta actividad, se recomienda: \n \nIndumentaria a usar: Para la instalación de barreras vivas es necesario el trazo de curva a nivel, mediante el uso de instrumentos nivel en “A” (estacas, palana, machete, piocha, entre otras).\n \nTamaño: Las curvas de nivel debe trazarse y tener un distanciamiento entre curvas de 30 a 40 cm. Luego, se pica la tierra con una dimensión de 30 cm x 30 cm y se procede a sembrar el cultivo seleccionado."]
[]
[]
[]
[null,"CONSTRUCCIÓN DE ZANJAS DE INFILTRACIÓN"]
[null,"Las zanjas de infiltración son pequeños canales de forma rectangular, cuya finalidad es retener el agua de escorrentía, que proviene de las partes altas del terreno, para que rompa la velocidad del agua, de tal manera que se capte y acumule en la zanja, para que sirva de reserva a los árboles y cultivos. El incremento de la disponibilidad de agua está destinado para la recuperación del ecosistema y de apoyo a la provisión el servicio ecosistémico de regulación hídrica.\n\nCriterios generales: Localización \n \n- Zonas de secano ya sea para pastos o plantaciones permanentes.\n- Terrenos con pendientes de 10 a 40%, en forma de talud. \nComo se puede ver en el cuadro siguiente, el distanciamiento entre zanjas depende de la inclinación del terreno y de las condiciones del ecosistema en términos de extensión de cobertura vegetal.\n- Terrenos con textura franca que dejen in­filtrar fácilmente el agua. No es apto para terrenos con texturas sueltas, que puedan derrumbarse."]
[]
[]
[null,null,null,"Cobertura vegetal",null,"Pendiente del terreno (%)",null,"Distancia entre zanjas (cm)"]
[null,null,null,"Sin",null,10,null,30]
[null,null,null,null,null,15,null,20]
[null,null,null,null,null,20,null,15]
[null,null,null,null,null,25,null,13]
[null,null,null,null,null,30,null,11]
[null,null,null,"Con",null,10,null,45]
[null,null,null,null,null,15,null,30]
[null,null,null,null,null,20,null,23]
[null,null,null,null,null,25,null,20]
[null,null,null,null,null,30,null,17]
[null,null,null,null,null,35,null,14]
[null,null,null,null,null,40,null,12]
[]
[]
[]
[]
[null,"Trazo, niveles y replante preliminar"]
[null,"- Se trazan las líneas a nivel (guía para excavar las zanjas) con ayuda del nivel “A” o nivel de \ncaballete, empezando siempre de la parte más alta de la ladera.\n\n- Se demarcan las líneas con ayuda de estacas o el pico, cavando un surco super­ficial que marque bien cada curva.\n\n- Se trasplanta pasto o cabuya a ambos lados de la zanja para protegerla."]
[]
[null,"Excavación de zanjas de infiltración"]
[null,"Se excava la zanja propiamente dicha, teniendo en cuenta las dimensiones indicadas (ancho de la base: 40 cm y altura o profundidad: 40 cm)."]
[]
[null,"Compactación del terreno"]
[null,"Una vez excavada la zanja con las medidas ya indicadas se procede a nivelación cuidadosa de la base o fondo de la zanja con ayuda del nivel en “A”. Todo el material extraído de la excavación de la zanja se coloca en su borde inferior, apisonando capa por capa, formando un bordo o camellón. \n \nRecomendaciones generales\n- Las zanjas no deben ser mayor a 200 m de largo.\n- Construir de diques o tabiques cada cierto trecho. De esta manera, la zanja queda dividida en secciones que regulan el almacenamiento de agua para las diferentes partes de la plantación. Sirve en terrenos de alta inclinación."]
[]
[]
[]
[]
[null,"INSTALACIÓN DE QOCHAS"]
[null,"Las qochas son pequeños depósitos de agua, que retienen y represan el agua de lluvia. A través de una lenta infiltración permiten recargar permanentemente las aguas subterráneas, manteniendo las manantes aguas abajo. El incremento de la disponibilidad de agua está destinado para la recuperación del ecosistema y de apoyo a la provisión el servicio ecosistémico de regulación hídrica.\n\nCriterios generales \n \nLocalización \nSu localización se da generalmente en las cabeceras de cuenca (sobre una quebrada, río o arroyo), para retener y represar el agua de lluvia. \n \nAnálisis del ecosistema\n Se debe considerar información topográfica pertinente que descomponga los principales componentes del suelo y su nivel de infiltración de agua, así como su nivel de pendiente."]
[]
[null,"Construcción de diques"]
[null,"Para garantizar de manera natural la reconstrucción o reposición natural del sistema de qochas, se recomienda la construcción de diques por qocha, a partir de la remoción de tierra compactada que permita contener parte del agua como excedente en el periodo de lluvias. \n \nDimensiones de diques\nLas dimensiones del dique estarán en función de la altura del espejo de agua y de la pendiente del terreno. Se recomienda construir diques de 1,00 m. de altura en promedio, con un ancho en la corona de 0.50 m y una base de 2.50 m. El ancho de la base del dique está en función de la altura del dique, del material a utilizar y del talud que se le dará a las paredes del muro. Para diques mayores de 1,50 m. de altura se requiere realizar estudios especializados.\n \nProceso de construcción\n \n- Colocar una primera capa con piedras grandes en la base y en las caras externa e interna del dique. Rellenar la parte central con piedras más pequeñas y compactarla con arcilla o arena. \n- Colocar la segunda capa con piedras grandes en ambas caras y rellenar la parte central del dique con piedras pequeñas y tierra arcillosa, compactando para impermeabilizar y evitar la pérdida de agua por filtración. Repetir este paso hasta llegar a la altura final del dique. \n- Cubrir con piedras planas la cara interna del dique, para evitar la erosión y disminuir la infiltración.\n- Echar tierra negra y estiércol en la cara externa y superior del dique, para garantizar el prendimiento de los pastos de las champas.\n- Colocar champas con pastos vivos, en la cara externa y superior del dique. Esto le dará mayor solidez y evitará la erosión por las lluvias y el viento. "]
[]
[]
[null,"CONSTRUCCIÓN DE TERRAZAS DE FORMACIÓN DE SUELOS"]
[null,"Las terrazas altoandinas son franjas secuenciales que dividen la ladera en secciones perpendiculares a la pendiente, cuyos límites superiores e inferiores están orientados según las curvas a nivel y se encuentran protegidas por muros de piedra (pircas) o bordes de tierra, según su tipo de construcción. Esta acción está destinada para la recuperación de suelos degradados. Por motivos de seguridad contra invasión de ganado, incremento de precipitación o cualquier otro desastre, se recomienda el uso de pircas para su construcción."]
[]
[null,"Trazo y marcación"]
[null,"- Se realiza primero la verificación de la pendiente del terreno. Para ello, se utiliza un palo de un metro de largo colocado al nivel el suelo y se mide el desnivel, el cual no debe ser mayor a 1%. \n- Se marcan “líneas maestras” en donde se construirán las terrazas y se dará el levantamiento de muros.\n \nRecomendaciones generales\n- Las distancias entre los muros no deben ser menores a 5 m, pues la mayoría de las familias utilizan la tracción animal (yunta) para la labranza, lo que dificultaría esta actividad. \n- Recordar que a mayor nivel de pendiente, menor debe ser el distanciamiento de los muros, pero se debe incrementar su altura.\n- Esta actividad puede ser complementada con las instalación de barreras vivas que dependerá del tipo de ecosistema y los requerimientos de agua y suelo por especie."]
[]
[null,null,null,"Pendiente del terreno (%)",null,"Distancia entre muros (m)",null,"Altura del muro (m)"]
[null,null,null,10,null,9.3000000000000007,null,0.99]
[null,null,null,15,null,7.3,null,1.1000000000000001]
[null,null,null,20,null,6.3,null,1.26]
[null,null,null,25,null,5.7,null,1.43]
[null,null,null,30,null,5.3,null,1.6]
[null,null,null,35,null,5,null,1.77]
[]
[]
[]
[null,"Remoción de tierra fértil"]
[null,"Mediante el uso de material nivel tipo “A”: picota, palas y carretilla, la construcción se inicia con la remoción de una franja de tierra de 0.60 m de ancho y 0.80 m de profundidad aproximadamente. Así, con el suelo removido se forma el camellón de la terraza, aguas arriba de la línea de nivel."]
[]
[null,"Compactación del borde de terraza"]
[null,"Luego, se debe afirmar la tierra sobre el camellón para prevenir la escorrentía del suelo y evitar desbordes por las altas precipitaciones en épocas de lluvia. Se debe abrir una pequeña zanja sobre la curva de nivel para la compactación de las piedras. Esta debe tener por lo menos un ancho de 40 cm."]
[]
[null,"Emparejamiento de la terraza"]
[null,"- Cuando se utiliza champa, se deberá construir un cimiento con una base mínima de 50 cm. \n- El camellón de tierra debe ser levantado hasta la altura que permite la masa de suelo excavada, recomendándose alturas de hasta 1.50 m.  \n- Se debe reforzar la terraza con plantaciones de pastos, arbustos o forestales, dependiendo de la zona de localización, en la parte superior de esta con el fin de prevenir relaves y escorrentía por la pendiente. \nEl pasto se debe plantar a una distancia de un pie (20 a 30 cm), los arbustos de 30 cm y las especies forestales en una distancia estándar de 3mx3m."]
[]
[null,"Mantenimiento de terraza andina"]
[null,"Las terrazas construidas con muros de tierra necesitan de un mantenimiento de tres veces por año (principalmente deben ser aprovechadas durante la época de estiaje), hasta lograr su completa estabilización y puedan cumplir así con su función de retención del agua y sedimentos hasta concluir su formación. Eso supone el uso de por lo menos 8 jornales al año. Las principales actividades requieren la reposición de la tierra debilitada y de las piedras de la base.\n \nEn caso de que la terraza sea construida con muros de piedra se debe reponer las piedras caídas para no alterar la estructura de la terraza y aumentar la altura de las piedras en épocas de lluvia."]
[]
[]
[null,"CAPACITACIÓN EN GESTIÓN INTEGRADA DE RECURSOS HÍDRICOS CON ENFOQUE DE CUENCUA"]
[null,"Perfil del capacitador\nEs un profesional en ingeniería ambiental, forestal, agrícola o afín, con especialización en manejo y/o gestión de recursos hídricos y con experiencia docente en temas vinculados a la gestión de recursos hídricos con enfoque de cuenca.\n \nPoblación objetivo\nEste curso está dirigido a población beneficiaria vinculada con la gestión del recurso hídrico y manejo de ecosistemas de interés hídrico, así como, los representantes de las empresas relacionadas con los servicios de abastecimiento y saneamiento, miembros de organismos locales, organizaciones no gubernamentales, entre otros. "]
[]
[null,"Coordinación con organización y comités de la comunidad existente"]
[null,"Las comunidades a atender poseen diferentes formas de organización (comités de cuenca, junta de usuarios de agua, juntas de usuarios de riego, entre otros). Para coordinar con estas, se recomienda la asistencia a las asambleas comunitarias, para determinar el planteamiento de la agenda y talleres de capacitación a desarrollarse."]
[]
[null,"Talleres de capacitación a organizaciones y comités de la comunidad existente"]
[null,"Los talleres de capacitación son sesiones de aprendizajes planificados y organizados, didácticamente ejecutados, sujetos a evaluación y monitoreo, asumiéndose además las siguientes consideraciones: \n- La capacitación está centrada en el logro de aprendizajes, respecto a la gestión integrada de recursos hídricos con enfoque de cuenca.\n- Las capacitaciones deberán tener un aforo de entre 15 y 20 personas, teniendo consideración al enfoque de género, que como destinatarios deben ser del perfil del público objetivo.\n\nLa capacitación implica la puesta en marcha de procedimientos metodológicos, en este caso, vinculados al desarrollo de capacidades de la población en velar por el cuidado de los ecosistemas y la provisión del servicio ecosistémico de regulación hídrica al entorno de la comunidad, de manera práctica. Por ejemplo: Capacidad de carga animal y rotación. Otros tópicos de interés serán: Uso del agua, gobernanza y metodología con enfoque comunitario, mecanismos de financiamiento y aplicación de la gestión integrada de recursos hídricos. Para ello, se recomienda el uso de los siguientes materiales:\n-Mapa parlante de zonas con mayor cantidad de cobertura vegetal y fauna doméstica.\n-Diagrama de cuenca.\n-Línea de tiempo de desastres.\n-Línea de tiempo de cambio de cobertura vegetal y fauna doméstica.\n-Matriz de análisis de conflictos.\n-Perfil de grupos de interés.\n-Matriz de análisis de exposición, vulnerabilidad y medidas de reducción del riesgo (MRR).\n-Diagrama de organización social.\n-Diagrama del sistema de riego (complementario).\n- Las sesiones de capacitación no deben tener una duración mayor a 120 minutos efectivos y dependerá del interés de los asistentes para focalizar la temática.\n- Formación de promotores o líderes para garantizar la sostenibilidad de la intervención mediante réplicas.\nA manera de ejemplo, se plantea algunos materiales a considerar para las dinámicas grupales planteadas Para mayor información, revisar: “Folleto 8: Orientaciones para la aplicación de herramientas participativas en los proyectos de inversión pública, (MEF – DGIP)”"]
[]
[null,null,null,"Materiales",null,null,"Cantidad"]
[null,null,null,"Cuaderno (50 hojas)",null,null,25]
[null,null,null,"Lapiceros",null,null,25]
[null,null,null,"Cartulinas escolares de colores",null,null,30]
[null,null,null,"Plumones N° 47 de colores",null,null,25]
[null,null,null,"Plumones N° 45 de colores",null,null,20]
[null,null,null,"Cuchilla cortapapel",null,null,1]
[null,null,null,"Masking tape 1''",null,null,5]
[null,null,null,"Cinta de embalaje transparente",null,null,1]
[null,null,null,"Papel sabana 60 gr.",null,null,120]
[null,null,null,"Cuaderno de 200 hojas",null,null,1]
[null,null,null,"Tijera grande",null,null,1]
[]
[]
[]
[]
[]
[]
[null,"ASISTENCIA TÉCNICA  EN EL MANEJO DE ECOSISTEMAS DE INTERÉS HÍDRICO"]
[null,"Perfil del capacitador\nEl perfil del profesional a cargo de las actividades de capacitación corresponde a las carreras profesionales de ingeniería forestal, agrícola, agronomía,  y biología, con competencia en proyectos de recuperación de ecosistemas de interés hídrico y manejos de recursos hídricos. \n\nPoblación objetivo\nLa presente acción está vinculada al desarrollo de capacidades técnicas a la población especializada en velar por la recuperación de los ecosistemas andinos de interés hídrico y la provisión del servicio ecosistémico de regulación hídrica. Estas formarán parte de diferentes organizaciones y comités de la comunidad."]
[]
[]
[null,"Coordinación con organización y comités de la comunidad existente"]
[null,"Las comunidades a atender poseen diferentes formas de organización (junta de usuarios, juntas de regantes, entre otros). Para coordinar con estas, se recomienda la asistencia a las asambleas comunitarias, para determinar el Planteamiento de la agenda y talleres de capacitación a desarrollarse, según el tipo de ecosistema andino de interés hídrico, cobertura vegetal y la acción realizada."]
[]
[null,"Talleres de asistencia técnica a organizaciones"]
[null,"Descripción\n- A diferencia de los talleres de capacitación, las sesiones de asistencia técnica usan la evidencia empírica y dinámicas prácticas para describir de mejor manera el manejo de los ecosistemas de interés hídrico. Para ello, se recomienda la delimitación de un espacio (parcela demostrativa) en donde se hará la demostración de la ejecución de diferentes actividades.\n- Aprovechar las jornadas de trabajo (jornales), pues son espacios efectivos para la asistencia técnica, al seguirse la metodología de “aprender haciendo”.\n\nAsistencia técnica en pastoreo rotativo\n\nDiseño de los espacios de pastos para el apotreramiento\n La sesión contempla como paso preliminar, la explicación de la actividad de apotreramiento: “El apotreramiento es una actividad realizada para el manejo sostenible del pastoreo del ganado que consiste en subdividir un campo en varias parcelas (potreros) que serán pastoreadas sistemáticamente de modo que mientras una parcela es pastoreada las demás descansan”. \n \nLuego, se explica cuáles son los requerimientos mínimos que deben tener las parcelas para apotreramiento:\n \n(i) Cercanía de la zona a fuentes de agua.\n(ii) Correcta delimitación de potreros o canchas de pastoreo.\n(iii) Planificación del pastoreo e identificación de zonas de sembrío. \n \nFinalmente, se establece el número de potreros, a partir de los siguientes factores:\n \n(i) Población total de ganado.\n(ii) Número de lotes o parcelas.\n(iii) Unidades animales por lote (densidad por lote) \n(iv) Sistema de pastoreo (clásico o diferido)\n(v) Número de potreros (hectáreas delimitadas)"]
[null,"Tecnología empleada: Para la demostración de la actividad, se debe emplear cintas para la marcación del terreno y rastrillos, palas y carretillas para la nivelación y limpieza del mismo.\n \nRotación de ganado\nA manera de dinámica, se traslada y rota animales en las potreras formadas al interior de la parcela demostrativa y se explica que la actividad debe hacerse de manera periódica, según al tipo de pastoreo rotativo a desarrollar.\n \nPastoreo rotativo clásico: la rotación del ganado se hace en función de la época del año, la oferta forrajera, la capacidad de carga animal, el número de animales y el tipo y clase de ganado. Generalmente esta práctica se realiza en pequeñas áreas de pastoreo. Como ejemplo, tómese el caso de 4 potreros. El potrero 1 es pastoreado durante 30 días. Luego de este periodo, se pasa a un potrero 2, y así sucesivamente hasta regresar al primer potrero. Por lo mismo, cada extensión de pastizal tiene un periodo de descanso de 90 días para poder fomentar el desarrollo de las especies.\n \nPastoreo rotativo diferido: Se prioriza la recuperación del pastizal. Para ello se programan uno o más potreros de pastoreo adicionales que descansan por temporadas largas (aprox. 3 años), hasta que entran en uso reemplazando a otros que inician su descanso por un tiempo similar con propósitos de recuperación. Esta práctica se realiza cuando se dispone de mayores extensiones de terreno para el pastoreo. \n \nRecomendación: \n- Para las condiciones de la sierra del Perú donde el crecimiento de los pastos naturales andinos es estacional y gran parte son áreas comunales, el sistema de pastoreo rotativo diferido con descanso estacional resulta el más recomendable. \n- Capacidad de carga = Unidades Animales/Superficie del terreno. \n\nDinámica empleada: Se recomienda la asociación con algún productor local y hacer la demostración en las áreas delimitadas con su ganado. Para garantizar la efectividad de la intervención se recomienda una visita al siguiente año para ver el crecimiento de la especie vegetal y el rendimiento productivo del ganado."]
[null,"Asistencia técnica en manejo de pastos naturales\n\nRotación de dormideros portátiles\n En otra parcela demostrativa se realiza el abonamiento de las praderas naturales con los propios animales de la zona a través de la práctica de dormideros portátiles. Para ello, la asistencia técnica debe comprender  las siguientes temáticas:\n \n- Determinación del área degradada o instalada a fertilizar.\n- Temporalidad de la intervención: Se recomienda que el traslado de animales sea de manera semanal. \n- Tamaño y tecnología usada en la intervención: Durante su estadía incorporan el estiércol y orinas al suelo; el estiércol acumulado es de una capa considerable de 1cm y distribuido uniformemente al suelo mediante la acción mecánica de las pezuñas de los animales, principalmente de los ovinos. \n \nMayor cantidad de animales en la comunidad, mayor probabilidad de rotación y de tener estiércol por día; sin embargo, no debe implicar incrementar la capacidad de carga del terreno para evitar el sobrepastoreo.\n \nTrasplante de pastos\nFinalmente, a manera demostrativa, se realiza una exposición sobre trasplante de pastos que consiste en propagar pastos naturales en terrenos desnudos. \n \n- Indumentaria a usar: se realiza con una picota, se hace un corte en el suelo y se introduce la base del macollo o del esqueje, luego se apisona para generar contacto entre el vegetal y el suelo. La distancia entre macollos es de 50 cm. \n- Densidad de la plantación: 40.000 plántulas por hectárea.\n- Temporalidad de la actividad: Esta acción principalmente debe realizarse en los meses de diciembre y enero (meses de lluvia). Se recomienda mantener irrigado el terreno, en caso exista irregularidad en las precipitaciones."]
[]
[]
[]
[null,"CAPACITACIÓN EN BUENAS PRÁCTICAS PARA LA ADAPTACIÓN AL CAMBIO CLIMÁTICO Y GESTIÓN DE RIESGOS"]
[null,"Perfil del capacitador\nEl perfil del profesional a cargo de las actividades de capacitación corresponde a las carreras profesionales de ingeniería forestal, agrícola, agronomía, biología, geografía y ciencias ambientales afines, con experiencia en proyectos de desarrollo que incluyen medidas de adaptación al cambio climático y gestión de riesgos. \n\nPoblación objetivo\nLa presente acción está vinculada al desarrollo de capacidades de la población en general dentro del ámbito de intervención."]
[]
[null,"Talleres de capacitación en adaptación al cambio climático y gestión de riesgos"]
[null,"La temática impartida en los talleres de capacitación incluirá: (i)  Conceptos básicos del cambio climático (CC); ii) La importancia de los servicios ecosistémicos de regulación hídrica y su afectación por el cambio climático; iii) Impactos del cambio climático en los medios de vida de la población; v) Medidas de adaptación basada en ecosistemas andinos de interés hídrico para incrementar resiliencia y disminuir vulnerabilidad en comunidades y (vi) gestión de riesgos en un contexto de cambio climático y eventos externos.\n \nA manera de referencia, considerar el siguiente ejemplo de usos de herramientas para la capacitación a población rural sobre adaptación al cambio climático:"]
[]
[null,null,null,"Herramienta participativa",null,"Análisis del riesgo"]
[null,null,null,"Mapa parlante de peligros asociados al cambio climático",null,"• Identificación de peligros y sus áreas de impacto.\n• Daños y pérdidas en ecosistemas de interés hídrico, medios de vida y población"]
[null,null,null,"Diagrama de cuenca",null,"• Peligro y exposición a riesgos asociados al cambio climático.\n• Identificación de áreas vulnerables (bosques, humedales, zonas inundables, etc.)"]
[null,null,null,"Línea de tiempo de desastres antrópicos y asociados al cambio climático.",null,"• Percepción del riesgo por parte del poblador.\n• Frecuencia de la ocurrencia de desastres."]
[null,null,null,"Línea de tendencias",null,"• Cambios en el clima y en el tiempo.\n• Cambio en la disponibilidad de los recursos."]
[null,null,null,"Diagrama de la organización social y mapeo de actores",null,"• Identificación de actores locales y sus roles. \n• Articulación de actores."]
[null,null,null,"Matriz de análisis de exposición, vulnerabilidad y manejo de recursos",null,"Exposición, fragilidad, resiliencia y adaptación de ecosistemas de interés hídrico."]
[null,null,null,"Cadena de efectos de impactos de cambio climático",null,"Impacto del Cambio Climático en la provisión de los servicios ecosistémicos de regulación hídrica."]
[]
[]
[]
[]
[]
[null,"SENSIBILIZACIÓN RELACIONADA A LA RECUPERACIÓN DEL SERVICIO ECOSISTÉMICO DE REGULACIÓN HÍDRICA"]
[null,"Población objetivo\nLas campañas de sensibilización permiten una participación abierta de toda la población, pues su objetivo es llegar a la mayor cantidad de personas para que sean estos los que sean agentes de cambio sobre la recuperación del servicio ecosistémico de regulación hídrica."]
[]
[null,"Campañas de sensibilización"]
[null,"La estrategia para realizar campañas de sensibilización ambiental involucra la entrega de volantes, folletos y el uso de medios de difusión masiva de información hacia la población beneficiaria y los grupos de comuneros organizados. En las comunidades, la radio y el radioparlante son dos instrumentos con gran potencial de convocatoria y de impartición de información, relativa a la importancia de la recuperación del servicio ecosistémico de regulación hídrica,  los ecosistemas de interés hídrico y el manejo adecuado del recurso hídrico.\n \nAdemás, las actividades a ejecutar también deben comprender dinámicas o estrategias lúdicas destinadas a la población joven. En caso se usen exposiciones comunales, es necesario que los contenidos estén contextualizados a la zona que se está interviniendo."]
[]
[]
[null,"INTERCAMBIO DE EXPERIENCIAS RELACIONADO A LA RECUPERACIÓN DEL SERVICIO ECOSISTÉMICO DE REGULACIÓN HÍDRICA"]
[]
[null,"Realización de pasantías"]
[null,"Está referido al traslado de un número determinado de representantes de la comunidad a un lugar donde hayan ejecutado acciones relacionadas a la recuperación del servicio ecosistémico de regulación hídrica, con la finalidad de conocer experiencias exitosas. Esto permitirá a los beneficiarios volcar los conocimientos adquiridos durante la pasantía en un proyecto en específico y similar.\n\n Esta actividad se realiza bajo el enfoque de intercambio de experiencias para la mejora de la gestión de los proyectos y sus impactos en la recuperación del servicio ecosistémico de regulación hídrica y de los ecosistemas de interés hídrico."]
[]
[]
[null,"CAPACITACIÓN A FUNCIONARIOS PÚBLICOS SOBRE GESTIÓN INTEGRADA DEL RECURSO HÍDRICO CON ENFOQUE DE CUENCA"]
[null,"Perfil del capacitador\nEs un profesional en ingeniería ambiental, forestal, agrícola o afín, con especialización en manejo y/o gestión de recursos hídricos. Con experiencia docente en temas vinculados a la gestión de recursos hídricos con enfoque de cuenca.\n\nPoblación objetivo\nLa presenta acción estará orientada al desarrollo de capacidades de servidores públicos. Esta acción contribuye a  garantizar la sostenibilidad del proyecto."]
[]
[null,"Talleres de capacitación sobre gestión de los ecosistemas"]
[null,"Los talleres de capacitación son sesiones de aprendizajes planificados y organizados, didácticamente ejecutados, sujetos a evaluación y monitoreo, asumiéndose además las siguientes consideraciones:\n \n- La capacitación está centrado en el logro de aprendizajes respecto a la gestión del servicio ecosistémico de regulación hídrica.\n- Las capacitaciones deberán tener un aforo de entre 15 y 20 personas.\n- Debido a la alta rotación de servidores públicos, se recomienda garantizar que la periodicidad con que se den las sesiones de capacitación sea anual.\n- Está relacionada al desarrollo de capacidades de los servidores públicos, orientadas al monitoreo del cuidado del ecosistema intervenido, que contribuyen a garantizar la sostenibilidad del proyecto. \n- Otros temas que podrán ser abordados durante el taller son: identificación de actores involucrados en la gestión integral de recurso hídrico, planificación local, estructura organizacional, planificación, instrumentos de gestión (planes) y documentos vinculados con la gestión del recurso hídrico. "]
[]
[]
[]
[null,"CAPACITACIÓN A FUNCIONARIOS PÚBLICOS SOBRE LAS MEDIDAS DE ADAPTACIÓN ANTE LOS EFECTOS DE CAMBIO CLIMÁTICO EN LA GESTIÓN INTEGRADA DE LOS RECURSOS HÍDRICOS"]
[null,"Perfil del capacitador\nEl perfil del profesional a cargo de las actividades de capacitación corresponde a las carreras profesionales de ingeniería forestal, agrícola, agronomía, biología, geografía y ciencias ambientales afines con experiencia en proyectos de desarrollo que incluyen medidas de adaptación al cambio climático y gestión de riesgos en un contexto de cambio climático. \n\nPoblación objetivo\nLa presenta acción estará orientada al desarrollo de capacidades de servidores públicos. Esta acción contribuye a garantizar la sostenibilidad del proyecto."]
[]
[null,"Talleres de capacitación sobre cambio climático"]
[null,"Los talleres de capacitación son sesiones de aprendizajes planificados y organizados, didácticamente ejecutados, sujetos a evaluación y monitoreo, asumiéndose las siguientes consideraciones:\n \n- La capacitación está centrado en el logro de aprendizajes, respecto a la gestión integrada de recurso hídrico con enfoque de cuenca.\n- Las capacitaciones deberán tener un aforo de entre 15 y 20 personas.\n- Debido a la alta rotación de servidores públicos, se recomienda garantizar que la periodicidad con que se den las sesiones de capacitación sea anual.\n \nComo referencia considerar la siguiente estructura en los talleres de capacitación sobre impactos del cambio climático en la gestión de los recursos hídricos:"]
[]
[null,null,null,null,"Actividad",null,"Descripción"]
[null,null,null,null,"Análisis de los impactos del cambio climático",null,"Identificación de los impactos actuales y futuros del cambio climático: por ejemplo, a través de escenarios climáticos en los diferentes niveles, observación del clima local y bioindicadores."]
[null,null,null,null,"Análisis de vulnerabilidad",null,"Identificación de la vulnerabilidad del contexto socioeconómico y ecológico en su conjunto frente a los impactos del cambio climático, con el fin de entender los riesgos y las oportunidades."]
[null,null,null,null,"Instrumentos de gestión para identificación de prioridades",null,"Identificación de posibilidades y necesidades de adaptación. También implica definición de prioridades dependiendo de factores como costo-beneficio, la percepción de riesgos y la información disponible"]
[null,null,null,null,"Asesoría en la formulación e implementación de políticas públicas,  planeamiento y gobernanza",null,"Acciones que contribuyen a la transversalización del cambio climático en políticas nacionales, planes e instrumentos de gestión sectoriales y territoriales, considerando las propuestas de pautas metodológicas para la transversalización del enfoque ambiental (Incluye CC, LCDS, DB, otros) en el planeamiento estratégico, institucional y operativo a nivel de territorios en el marco del SINAPLAN ; y a la articulación con los compromisos nacionales e internacionales (Contribuciones Nacionalmente Determinadas)."]
[null,null,null,null,"Institucionalidad y gobernanza para el cambio climático",null,"• Componentes de la gobernanza, (actores, espacios de articulación, mecanismos de articulación. etc.)\n• Procesos de gestión ante el cambio climático nacionales, sectoriales y regionales y su necesidad de articulación."]
[null,null,null,null,"Proyectos de Inversión",null,"Asesoría y acompañamiento para la incorporación de medidas de adaptación y de gestión de riesgos en el diseño de proyectos de inversión pública."]
[]
[]
[]
[]
[]
[null,"DESARROLLO DE CAPACIDADES PARA EL MONITOREO Y SEGUIMIENTO DE LOS ECOSISTEMAS DE INTERÉS HÍDRICO Y EL SERVICIO ECOSISTÉMICO DE REGULACIÓN HÍDRICA"]
[null,"La presente acción estará orientada al desarrollo de capacidades de servidores públicos y autoridades comunitarias. Esta acción contribuye a  garantizar la sostenibilidad del proyecto.\n\nCriterios Generales\nIdentificación de información de base existente: estudios e indicadores medibles para los factores del servicio ecosistémico de regulación hídrica, en el diagnóstico.\nDotación de equipamiento mínimo necesario para el monitoreo de los indicadores en temas de cobertura vegetal, suelo y recurso hídrico. Por ejemplo: \n- Construcción de vertederos para la medición de caudales.\n- Equipos portátiles para medición de la calidad de agua y suelo.\n- GPS.\n- Dendómetros, para la medición del diámetro del árbol, entre otros."]
[]
[null,"Talleres de capacitación sobre monitoreo y seguimiento"]
[null,"Uso de indumentaria\nEl uso de la tecnología existente, a partir de la planificación del proyecto estará relaciona a los siguientes factores:\n- Tipo de ecosistema de interés hídrico recuperado.\n- Tipo de servicio ecosistémico provisto.\n- Selección de tipo de monitoreo y seguimiento: (i) cobertura vegetal, (ii) suelos o (iii) regulación del recurso hídrico.\n\nUso de información\n- Se debe aprovechar la información provista principalmente por los indicadores que deben tener la capacidad de ser medibles fácilmente y ser actualizados con cierta periodicidad. De manera estándar se recomienda que deben ser recopilados anualmente. Además, se recomienda clasificar los indicadores según el objetivo a medir que puede ser: producto, resultado o impacto. \n- Tomar los estudios de base para realizar: (i) inventarios de cobertura vegetal, (ii) seguimiento a indicadores de calidad y cantidad en provisión de agua, entre otros."]
[]
[]
[null,"INTERCAMBIO DE EXPERIENCIA SOBRE GESTIÓN INTEGRADA DEL RECURSO HÍDRICO, CON ENFOQUE DE CUENCA"]
[null,"Población objetivo\nLa presente acción estará orientada al desarrollo de capacidades de servidores públicos y autoridades comunitarias. Esta acción contribuye a  garantizar la sostenibilidad del proyecto.."]
[]
[]
[null,"Realización de pasantías"]
[null,"Las actividades que se consideran a continuación se centran en la modalidad de pasantías en localidades donde se hayan ejecutado proyectos considerados de éxito, relacionados con la gestión del recurso hídrico y manejo de ecosistemas de interés hídrico. \n \nComo pasantía, se entiende al traslado de un número determinado de representantes delimitados en la población objetivo, hacia otra comunidad que ya ha adquirido el conocimiento objetivo que se quiere lograr para un proyecto en específico y similar.\n \nSe recomienda enfocar la temática de las pasantías en la correcta gestión integrada del recurso hídrico con enfoque de cuenca. Para ello, en la pasantía se debe contemplar la realización de dinámicas, como grupos de trabajo, la discusión de planes de manejo de cuenca, inventarios de cobertura vegetal, entre otros."]

{"sheet":"HORIZONTE","index":43,"n_rows":12,"n_cols":5,"rows_kept":12,"cut":false,"hidden":false,"merged":[[6,5,7,7],[12,1,12,3],[13,1,13,3]]}
[]
[]
[]
[]
[]
[]
[]
[null,null,"EJECUCIÓN","FUNCIONAMIENTO"]
[null,"FORMACIÓN VEGETAL","RECUPERACIÓN DE COBERTURA*","BENEFICIOS DIRECTOS**","HORIZONTE DE EVALUACIÓN\n(EJECUCIÓN + FUNCIONAMIENTO)"]
[null,"PASTURAS/PASTIZALES","2-3 AÑOS","3-5 AÑOS","5 - 8 años"]
[null,"ARBUSTOS ANDINOS","3-5 AÑOS","5 AÑOS A MAS","8 a más años"]
[null,"ÁRBOLES ANDINOS","5-7 AÑOS","MAS DE 5 AÑOS","10 a más años"]

{"sheet":"Hoja3","index":44,"n_rows":0,"n_cols":0,"rows_kept":0,"cut":false,"hidden":true,"merged":[]}

{"sheet":"TAMAÑO","index":45,"n_rows":14,"n_cols":3,"rows_kept":14,"cut":false,"hidden":false,"merged":[[6,1,6,10],[11,1,11,10],[12,2,12,10],[13,2,13,10],[7,2,7,10],[8,2,8,10]]}
[]
[]
[]
[]
[]
[]
[null,"Tamaño de la plantación"]
[null,"Definición\ntamaño","La planificación de especies es una actividad que involucra determinar la cantidad de especies a instalar en terreno definitivo, según el tipo de ecosistema , ya sea a partir de la producción o adquisición de plantones."]
[null,"Consideraciones  para tamaño","• Localización del proyecto, su objetivo y las propiedades en el uso de cada especie forestal (árboles y arbustos) que contribuyan a lograrlo. \n• Requerimiento de agua y luz solar de la especie.\n• Tipo de suelo y pendiente del terreno, en la cual se desarrolla.\n• Densidad de plantación por especie, según sus características de crecimiento y requerimientos de recursos adicionales.\n• Costos asociados por transporte de la especie, hacia el lugar donde se realizará la plantación.\n• Tiempo de siembra de los plantones."]
[]
[]
[null,"Tamaño-Implementación de viveros forestales"]
[null,"Actividades","Descripción de la actividad"]
[null,"Tamaño","El tamaño del vivero depende directamente de la capacidad de plantones a producir. Así, se tienen las siguientes características:\n\n• Camas de germinación: El tamaño de las camas de germinación o almacenamiento se recomienda tenga una medida de 1.20m de ancho y 5m de largo. Este tamaño estándar es usado para la producción de 1,000 plantones, en su etapa de plántula. Además, cada cama de repique estará distanciada por 0.6m.\n•  Perímetro de protección: \n   - El perímetro del vivero será cercado con madera rolliza u otro material, como mallas para cercos.\n   -  Los postes para la delimitación del perímetro tendrán un distanciamiento de 2.0 m entre postes y se instalará alambre de púas para su protección.\n• Espacios complementarios: El vivero debe contar con dos espacios, uno para la preparación de sustratos y una zona de acondicionamiento de plantones para transporte. "]

{"sheet":"CRITERIOS DE LOCALIZACION","index":46,"n_rows":67,"n_cols":8,"rows_kept":67,"cut":false,"hidden":false,"merged":[[41,1,41,11],[42,1,43,2],[42,3,43,11],[46,1,46,11],[47,1,48,2],[47,3,48,11],[31,1,31,11],[32,1,33,2],[32,3,33,11],[36,1,36,11],[37,1,38,2],[37,3,38,11],[18,3,19,11],[25,1,25,11],[26,1,27,2],[26,3,27,11],[20,1,20,11],[21,1,21,2],[21,3,21,11],[22,1,22,2],[22,3,22,11],[18,1,19,2],[9,1,10,2],[8,1,8,11],[11,1,11,11],[9,3,9,11],[10,3,10,11],[13,3,13,11],[12,3,12,11],[12,1,12,2],[13,1,13,2],[17,1,17,11],[51,3,55,4],[51,5,51,6],[51,7,51,8],[52,5,52,6],[52,7,52,8],[53,7,53,8],[54,5,54,6],[54,7,54,8],[55,5,55,6],[55,7,55,8],[53,5,53,6],[50,3,50,4],[50,5,50,6],[50,7,50,8],[65,1,65,11],[66,1,67,2],[66,3,67,11],[60,5,60,6],[60,7,60,8],[61,5,61,6],[61,7,61,8],[62,5,62,6],[62,7,62,8],[56,3,62,4],[56,5,56,6],[56,7,56,8],[57,5,57,6],[57,7,57,8],[58,5,58,6],[58,7,58,8],[59,5,59,6],[59,7,59,8]]}
[]
[]
[]
[]
[]
[]
[]
[]
[null," I. REFORESTACIÓN CON ESPECIES NATIVAS"]
[null,"Criterios Generales",null,"Para determinar el área a restaurar, es recomendable el uso de imágenes satelitales representativas de la zona degradada para la realización de un análisis histórico comparativo del estado del ecosistema, en un rango aproximado de 10 a 30 años. Además, tener en cuenta los siguientes criterios:"]
[null,null,null,"o Según la disponibilidad de la información, el formulador deberá establecer años representativos o subperíodos para realizar esta subactividad.\no Las imágenes deben garantizar el reconocimiento de los atributos del ecosistema: (i) florística del sitio (árboles y arbustos), (ii) estabilidad del suelo e (iii) integridad biótica. Esto implica asegurar que la actividad de reforestación facilite la heterogeneidad, integralidad y armonía entre los atributos.\no De manera complementaria, realizar estudios de composición del suelo por tipo de ecosistema y las especies de cobertura vegetal predominantes."]
[null,"    Implementación de viveros forestales"]
[null,"Actividades",null,"Descripción de la actividad"]
[null,"Localización",null,"De manera referencial, se establecen los siguientes criterios para la localización del vivero:\n\n• Cada vivero debe instalarse lo más cerca del área de plantación final, para evitar cambios bruscos en el ambiente y afianzar la adaptabilidad de la especie.\n• El vivero debe ser de fácil acceso y cercano a vías de fácil tránsito en el área de ejecución.\n• El recinto debe tener disponibilidad de agua durante todo el proceso de producción de plantones, principalmente en periodos secos o de estiaje.\n• El recurso hídrico empleado no debe estar contaminado, libre de agentes patógenos y residuos de productos químicos usados en actividades agropecuarias.\n• La zona de intervención es preferible que sea de topografía plana o pendiente muy suave, no mayor a 3% de inclinación con la finalidad de lograr el escurrimiento de las aguas de lluvia y evitar la formación de charcos durante estas.\n• Cesión en uso: Se debe coordinar con la comunidad explicando las oportunidades del vivero en la comunidad y la necesidad de ubicarlo en dicha zona.\n• Se tiene la georeferenciación de la zona de intervención."]
[]
[]
[]
[null,"II. REVEGETACIÓN CON ESPECIES NATIVAS"]
[null,"Criterios generales",null,"Para determinar el área a revegetar, es recomendable el uso de imágenes satelitales representativas de la zona degradada para la realización de un análisis histórico comparativo del estado del ecosistema, en un rango aproximado de 10 a 30 años. Además, tener en cuenta los siguientes criterios:\n \n• Según la disponibilidad de información, el formulador deberá establecer años representativos o subperíodos para realizar esta subactividad.\n• Las imágenes deben garantizar el reconocimiento de los atributos del ecosistema: (i) florística del sitio (entre gramíneas, graminoides, leguminosas y otras especies herbáceas), (ii) estabilidad del suelo e (iii) integridad biótica. Esto implica asegurar que la actividad de reforestación facilite la heterogeneidad, integralidad y armonía entre los atributos.\n• De manera complementaria, realizar estudios de composición del suelo por tipo de ecosistema y las especies de cobertura vegetal predominantes.\n• Se podría incluir hasta un 10% de especies exóticas como parte de la sostenibilidad de la revegetación.\n \nEste proceso se debe aplicar para todo tipo de ecosistema."]
[]
[null,"Siembra de especies herbáceas seleccionados"]
[null,"Actividades",null,"Descripción de la actividad"]
[null,"Localización de área a revegetar",null,"Para realizar la elección del terreno se debe tener en cuenta las siguientes condiciones: · \n• Que el terreno cuente con disponibilidad de agua todo el año, para poder realizar riegos oportunos y tener buena producción de pastos. \n• Suelos con buen drenaje, es decir que no sean oconales o presenten charcos de agua. \n• Suelo profundo y no rocoso. \n• Terreno de preferencia plano o con ligera pendiente (no mayor a 3%, caso contrario intentar nivelarlo). \n • Una vez elegido el terreno se debe realizar el muestreo de suelo para su respectivo análisis en el laboratorio, según el resultado se realiza la programación de la cantidad de fertilizantes a emplear. Así, se obtiene el pH o nivel de acidez o salinidad del suelo.\n • Un suelo óptimo para los cultivos son los que presentan un pH neutro, eso significa que no es salino ni tampoco ácido. Considerar que la mayoría de los suelos de la sierra son relativamente ácidos."]
[]
[]
[null,"III. INSTALACIÓN DE CERCOS EXCLUIDORES"]
[null,"Criterios Generales de Localización",null,"Para determinar el área a proteger, es recomendable el uso de imágenes satelitales representativas de la zona degradada para la realización de un análisis histórico comparativo del estado del ecosistema, en un rango aproximado de 10 a 30 años. Además, tener en cuenta los siguientes criterios:\n \n• Según la disponibilidad de información, el formulador deberá establecer años representativos o sub-períodos para realizar esta sub-actividad.\n•  Las imágenes deben garantizar el reconocimiento de los atributos del ecosistema: (i) florística del sitio, (ii) estabilidad del suelo e (iii) integridad biótica. Esto implica asegurar que la actividad de reforestación facilite la heterogeneidad, integralidad y armonía entre los atributos.\n\nPara el traslado e instalación de postes de madera, se deberá considerar los siguientes criterios: \nCondiciones de acceso hacia cada zona: \n• En caso no existan rutas pavimentadas, el trabajo de traslado se realizará mediante el uso de animales de carga, o de vehículos para el transporte de mayor cantidad de postes. \n• Este trabajó debe hacerse en colaboración con los comuneros de la zona, por lo que la unidad de medida a considerar es el número de postes trasladados por jornal."]
[]
[]
[]
[]
[null,"IV. CONSTRUCCIÓN DE TERRAZAS DE FORMACIÓN DE SUELOS"]
[null,"Criterios generales de localización",null,"Como criterios de localización de terrazas de formación lenta, se tiene:                                                                                                                                                                                                              \n• Presencia de suelos degradados. \n• Zonas con invasión de ganado.\n•  Áreas de incremento de precipitación o cualquier otro desastre.\n• Pendiente"]
[]
[]
[]
[null,"V. REPARACIÓN DEL CANAL AMUNADOR"]
[null,"Criterios generales de localización",null,"El criterio de localización es:\n• Identificación de los sistemas de amunas o canales articulados a los tipos de ecosistema a atender. \n\nPara ello, se recomienda formular estudios básicos que involucren la identificación de la geomorfología de la zona (tipo de suelos, pendientes), fuentes hídricas aledañas y la situación de los canales, según sus niveles de erosión."]
[]
[]
[]
[null,"VI. REPARACIÓN DEL CANAL DE MAMANTEO"]
[null,"Criterios generales de localización",null,"El criterio de localización es:\n• Identificación de los canales de mamanteo articulados a los tipos de ecosistema a atender. \n\nPara ello, se recomienda formular estudios básicos que involucren la identificación de la geomorfología de la zona (tipo de suelos, pendientes), fuentes hídricas aledañas y la situación de los canales, según sus niveles de erosión."]
[]
[]
[]
[null,"VII. CONSTRUCCIÓN DE ZANJAS DE INFILTRACIÓN"]
[null,"Criterios generales de localización",null,"• Zonas de secano ya sea para pastos o plantaciones permanentes.\n• Terrenos con pendientes de 10 a 40%, en forma de talud. \nComo se puede ver en el cuadro Nº 7, el distanciamiento entre zanjas depende de la inclinación del terreno y de las condiciones del ecosistema en términos de extensión de cobertura vegetal.\n• Terrenos con textura franca que dejen in­filtrar fácilmente el agua. No es apto para terrenos con texturas sueltas, que puedan derrumbarse."]
[]
[]
[null,null,null,"Cobertura vegetal",null,"Pendiente del terreno (%)",null,"Distancia entre zanjas (cm)"]
[null,null,null,"Sin",null,10,null,30]
[null,null,null,null,null,15,null,20]
[null,null,null,null,null,20,null,15]
[null,null,null,null,null,25,null,13]
[null,null,null,null,null,30,null,11]
[null,null,null,"Con",null,10,null,45]
[null,null,null,null,null,15,null,30]
[null,null,null,null,null,20,null,23]
[null,null,null,null,null,25,null,20]
[null,null,null,null,null,30,null,17]
[null,null,null,null,null,35,null,14]
[null,null,null,null,null,40,null,12]
[]
[]
[null," VIII. INSTALACIÓN DE QOCHAS"]
[null,"Criterios generales de localización",null,"Localización \nSu localización se da generalmente en las cabeceras de cuenca (sobre una quebrada, río o arroyo), para retener y represar el agua de lluvia. \n \nAnálisis del ecosistema\nSe debe considerar información topográfica pertinente que descomponga los principales componentes del suelo y su nivel de infiltración de agua, así como su nivel de pendiente."]

{"sheet":"TECNOLOGIA","index":47,"n_rows":158,"n_cols":16,"rows_kept":158,"cut":false,"hidden":false,"merged":[[154,1,154,10],[156,1,156,10],[157,1,157,10],[148,1,148,10],[150,1,150,10],[151,1,151,10],[147,1,147,10],[153,1,153,10],[141,1,141,10],[142,1,142,10],[144,1,144,10],[145,1,145,10],[132,1,132,10],[134,1,134,10],[135,1,135,10],[137,1,137,10],[138,1,138,10],[124,1,124,10],[125,1,125,10],[128,1,128,10],[129,1,129,10],[131,1,131,10],[116,1,116,10],[111,1,111,10],[109,1,109,10],[118,1,118,10],[119,1,119,10],[121,1,121,10],[122,1,122,10],[115,1,115,10],[112,1,112,10],[102,1,102,10],[103,1,103,10],[105,1,105,10],[106,1,106,10],[108,1,108,10],[99,1,99,2],[100,1,100,2],[99,3,99,6],[99,7,99,10],[100,3,100,6],[95,3,95,6],[95,7,95,10],[89,1,89,10],[90,1,90,10],[92,1,92,10],[100,7,100,10],[95,1,95,2],[96,1,96,2],[96,3,96,6],[96,7,96,10],[97,1,97,2],[98,1,98,2],[97,3,97,6],[97,7,97,10],[98,3,98,6],[98,7,98,10],[64,1,64,10],[66,1,66,10],[67,1,67,10],[55,1,55,10],[56,1,56,10],[57,1,57,10],[58,1,58,10],[59,1,59,10],[46,3,46,10],[47,3,47,10],[48,1,48,2],[49,1,50,2],[48,3,48,10],[49,3,49,10],[50,3,50,10],[52,1,52,10],[33,3,33,10],[34,3,34,10],[33,1,33,2],[34,1,34,2],[37,8,37,10],[38,8,38,10],[39,8,39,10],[40,8,40,10],[41,8,41,10],[37,6,37,7],[38,6,38,7],[39,6,39,7],[40,6,40,7],[41,6,41,7],[18,3,18,10],[21,1,21,10],[22,1,22,10],[18,1,18,2],[32,1,32,2],[23,1,23,10],[24,1,24,10],[25,1,25,10],[26,1,26,10],[27,1,27,10],[30,1,30,10],[31,1,31,10],[32,3,32,10],[7,1,7,10],[8,2,8,10],[9,2,9,10],[17,1,17,2],[16,1,16,2],[11,1,11,10],[14,1,14,10],[15,1,15,10],[16,3,16,10],[17,3,17,10],[68,1,68,10],[69,1,69,10],[70,1,70,10],[72,1,72,10],[73,1,73,10],[45,1,45,2],[36,1,36,10],[37,1,37,2],[38,1,38,2],[39,1,39,2],[42,1,42,10],[44,1,44,10],[45,3,45,10],[40,1,40,2],[41,1,41,2],[37,3,37,5],[38,3,38,5],[39,3,39,5],[40,3,40,5],[41,3,41,5],[46,1,46,2],[47,1,47,2],[60,1,60,10],[61,1,61,10],[83,1,83,10],[84,1,84,10],[86,1,86,10],[87,1,87,10],[93,1,93,10],[94,7,94,10],[94,3,94,6],[94,1,94,2],[74,1,74,10],[75,1,75,10],[78,1,78,10],[80,1,80,10],[81,1,81,10]]}
[]
[]
[]
[]
[]
[]
[]
[null," I. REFORESTACIÓN CON ESPECIES NATIVAS"]
[null,"Definición","La reforestación consiste en repoblar las zonas que en el pasado histórico reciente estaban cubiertas por bosques que han sido eliminados por diversos motivos: explotación de la madera para fines industriales o para consumo como plantas, ampliación de la frontera agrícola o ganadera, ampliación de áreas urbanas e incendios forestales."]
[null,"Criterios generales","Reconocimiento del tipo de ecosistema\n\nEn zonas andinas, los cinco ecosistemas son:\n• Bosque relicto altoandino (queñoal y otros).\n• Bosque relicto montano de vertiente occidental. \n• Bosque relicto mesoandino.\n• Bosque estacionalmente seco interandino (Marañón, Mantaro, Pampas y Apurímac).\n• Matorral andino.\n\nAdemás, esta actividad se realizará tomando en cuenta las siguientes consideraciones: (i) exposición solar, pues hacia el hemisferio sur las laderas con dirección norte reciben mayor exposición solar. Por lo tanto, preferentemente se deben ubicar las plantaciones en laderas con exposición sur, las cuales son más húmedas; y (ii) el rango altitudinal y pendiente por especie."]
[]
[null,"1. Planificación de especies a adquirir o producir"]
[]
[]
[null,"2. Implementación de viveros forestales"]
[null,"DEFINICION\nEl vivero es un ambiente, cuyo objetivo es albergar y producir un número determinado de plantones para su posterior uso en las actividades de plantación. Estos pueden clasificarse según su uso y según su temporalidad:\n\nSegún su uso: viveros forestales, viveros para ornamentación, viveros de investigación y viveros de frutales.\nSegún temporalidad: volantes o temporales y fijos o permanentes. Los viveros temporales son mayormente empleados para la producción de especies forestales y frutales, mientras que los permanentes para plantas ornamentales u hortalizas."]
[null,"Actividades",null,"Descripción de la actividad"]
[null,"Procedimiento para la instalación del vivero",null,"Para iniciar con la instalación del vivero, se deben seguir los siguientes pasos:\n\n1. Limpieza del terreno, a partir de la remoción de maleza, piedras, troncos u otros obstáculos.\n2. Mantener aquella vegetación que sirva como sombra natural o de soporte para las especies que lo requieran.\n3. Nivelar el terreno para hacerla plana, con una ligera inclinación de hasta 3%.\n4. Orientar la posición de las camas de repique de este a oeste para favorecer la entrada de la luz solar por mayor tiempo.\n5. Desinfectar el suelo.\n6. Instalación de canales de filtración de agua.\n7. Para el techo o tinglado del vivero se recomienda el uso de mallas de protección transparentes que permitan la entrada de luz solar y mantengan la humedad y la temperatura del ambiente."]
[null,"Materiales de construcción generales y tecnología a emplear",null,"- Sistema de riego (nebulización, microaspersión).\n- Almacigueras.\n- Invernaderos .\n- Sustratos.\n- Materiales de aislamiento (postes, cemento, ladrillos, alambres, plásticos o mallas de aislamiento)."]
[]
[]
[null,"Labores culturales en producción de plantones"]
[null,"Preparación del sustrato\nEl sustrato orgánico se entiende como la mezcla de suelo (tierra negra), arena y materia orgánica (estiércol de ganado vacuno, carnero, gallinaza, humus, compost, entre otros) que se usa para llenar las bolsas en el vivero para la producción de plantones. Este también puede ser combinado en proporciones mínimas con cal u otro material que minimice los niveles de salinidad y acidez del suelo. Esto dependerá de la disponibilidad de materiales en la zona.\n \nCriterio técnico sugerido: \n- La muestra comúnmente utilizada en semilleros o germinadores es una relación de 1 a 3 para materia orgánica o compost (30%) y tierra o arena cernida (70%), respectivamente. Esto es lo mismo a decir, una carretilla de materia orgánica y tres carretillas de arena.\n- En el caso de bolsas de almacigo o tubetes, la relación es de 1 a 2, o una carretilla de materia orgánica y dos de arena. \n- Adicionalmente, se recomienda agregar 6 kg de cal para disminuir los niveles de acidez.\n- Considerar su desinfección mediante uso de agua hirviendo y algún material que ahisle el calor (puede ser la propia bolsa de almacigo), previa siembra de semillas."]
[null,"Pasos para la siembra de semillas (almacigado)\nSe debe tener en cuenta las siguientes consideraciones:\n \n- Se hacen hoyos para el sembrío, cuyo tamaño ronda los 1.5 y 2 cm en promedio.\n- Las semillas deben estar previamente escarificadas y bien espaciadas entre sí (3 - 4 cm una de otra) en cada bolsa.\n- Se siembra las semillas con el micrópilo (orificio que se obtiene mediante la escarificación) hacia abajo, puesto que esto facilita la germinación de la planta, ya que tiene germinación epigea.\n- Se cubre las semillas (presionarlo ligeramente) con el mismo sustrato usado para llenar las bolsas.\n- Por último, se riega el sustrato después de la siembra."]
[null,"Repique de plántula\nEl proceso de repique consiste en la separación y trasplante de plántulas en bolsas de almacigo, según las condiciones de agua y abonamiento para la misma especie. Algunas recomendaciones a considerar son:\n\n- Plántulas en mal estado: En caso en una bolsa no germine ninguna de las 2 semillas sembradas, se debe repicar una plántula sana de alguna bolsa de almacigo que tenga 2 plántulas de la misma especie y hacer el trasplante respectivo. \n- Plántulas sin germinar: Retirar o remover las plántulas más pequeñas de las bolsas donde han permanecido sin germinar, teniendo cuidado de no dañar la plántula nueva."]
[null,"Control fitosanitario\nAproximadamente durante el primer mes y medio de crecimiento de las plántulas, se las debe regar 1 vez cada 10 días en promedio por especie, con una solución controladora de hongos, evitándose con esto problemas de chupadera fungosa, enfermedad muy común en viveros de forestales. En caso de presentarse plagas (insectos), se recomienda  utilizar un tipo de agente para control de estos eventos."]
[null,"Riego\nIndumentaria usada: La acción de riego se realiza usando la regadera o una manguera con un aspersor en su extremo final.\nTemporalidad de la intervención: Cada 3 o 4 días durante el primer mes y medio, y luego cada vez que sea necesario según las condiciones climáticas (aproximadamente cada semana)."]
[null,"Deshierbos y remoción de sustrato\n\nTemporalidad de la intervención \nLos deshierbos deben realizarse cada vez que se considere necesario. Se recomienda realizarlo cada mes y medio, evitándose con esta práctica la posible competencia entre las malas hierbas y el plantón. \n\nActividades complementarias: \n- Regar el cultivo con una hora de anticipación al deshierbo.\n- Remoción del sustrato superficial de las bolsas (con los dedos), con la finalidad de que se rompan las probables capas duras de tierra que puedan existir, y así el agua de riego pueda penetrar libre y rápidamente en todo el sustrato de la bolsa. \n- Control de plantas invasoras."]
[]
[]
[null,"Plantación propiamente dicha"]
[null,"Tipo de plantación"]
[null,"Criterio",null,"Clasificación de las plantaciones"]
[null,"Con base en el ecosistema utilizado",null,"- Plantación en macizo: Este sistema es el más utilizado que consiste en la siembra de plantones en sitios de baja cobertura vegetal y arbustiva. Con ello, las especies plantadas se vuelven en las dominantes del sitio. \n\n- Plantación de enriquecimiento: Con versatilidad para ser usada en fajas, parcelas o en claros. Esta plantación se realiza con el objetivo de recuperar el valor comercial de los bosques naturales. Estas plantaciones se realizan dentro del bosque buscando áreas desprovistas de cobertura vegetal. \n\n- Plantación de enriquecimiento con manejo de la regeneración natural: Además de incorporar especies en campos descubiertos dentro de los bosques, la regeneración natural pretende eliminar otras especies que compitan y pongan en riesgo a la especie plantada."]
[null,"Con base a la composición de especies",null,"- Plantación pura o mono específica: Son aquellas que usan solo una especie.\n\n- Plantación mixta: Incluyen dos o más especies en un mismo espacio geográfico, con el objetivo de proveer diferentes productos forestales y complementar el rendimiento y regeneración entre especies."]
[]
[null,"Sistema de plantación\nLuego, según el tipo de plantación, es necesario establecer el distanciamiento entre plantones en campo definitivo y sus principales efectos. De manera general, en el siguiente cuadro, se detalla la propuesta de la guía sobre el sistema de plantación a seguir, con su respectivo porcentaje de merma o plantones a replantar:"]
[null,"Distanciamiento o sistema de plantación (mxm)",null,"Plantones por hectárea",null,null,"Mortalidad aceptable (%)",null,"Número de plantones a replantar"]
[null,"3.0x3.0",null,1.111,null,null,0.2,null,257]
[null,"3.5x3.5",null,816,null,null,0.15,null,141]
[null,"4.0x4.0",null,625,null,null,0.1,null,72]
[null,"5.0x5.0",null,400,null,null,0.05,null,23]
[null,"El distanciamiento de plantones, también va a estar en función del diseño de la plantación:\n \n- Diseño cuadrangular: utilizados en terrenos planos.\n- Diseño a tres bolillo: utilizados en terrenos de pendiente pronunciada o para formaciones vegetales usadas como cortinas rompevientos.\n- Diseño en curvas de nivel: utilizados en terrenos de pendientes pronunciadas con fines de control de la erosión, principalmente.\n \nAun así, la distribución de especies nativas por tipo de ecosistema es altamente heterogénea, por lo que se sugiere tomar la información del cuadro Nº 5 de manera referencial. Además, se sugiere tomar en cuenta que, a mayor distanciamiento de plantones, las labores culturales como deshierbo y control de plantas invasoras, así como los requerimientos de agua en la plantación son mayores."]
[]
[null,"Hoyación\nA manera de referencia se sugiere revisar lo realizado por FONAM (2007). Luego del trazado de líneas de instalación, según el formato optado, y la delimitación de la cantidad óptima de plantones, se procede a la apertura de los hoyos."]
[null,"Características",null,"Descripción"]
[null,"Materiales a usar",null,"Picos, palas y barretas."]
[null,"Diseño",null,"La apertura de hoyos para forestales se realizará a una profundidad de 0.5 m y un diámetro de 0.4 m."]
[null,"Duración de actividad",null,"Para aprovechar la infiltración del agua en las primeras lluvias, el trabajo deberá realizarse entre los meses de octubre y diciembre."]
[null,"Recomendaciones",null,"Los hoyos deben ser dos veces más anchos y dos veces más hondos que la bolsa (en caso se utilice una plantación con este método)."]
[null,null,null,"Las dimensiones promedio de los hoyos son: 40 cm x 40 cm x 40 cm."]
[]
[null,"Establecimiento de la plantación\nA continuación, se presentan los pasos generales y recomendados para el establecimiento de la plantación en terreno definitivo:\n \nPrimer paso: colocar en la base la parte con contenido de materia orgánica. \nSegundo paso: quitar la bolsa del plantón y colocar la planta de forma vertical en la parte central del agujero, llenando el contorno del hoyo con la otra parte de tierra que servirá́ de sostén para la planta. \nTercer paso: se afirma la tierra para que quede compactada. \n\nRecomendaciones adicionales: \n- Dejar un espacio de 2 a 3 cm entre la superficie del hoyo y la del terreno para facilitar la captación del agua. \n- Mantener siempre el terreno húmero, más aún en épocas de estiaje y, en el caso las haya bastante exposición solar, evitar sobreexponer las raíces por periodos largos de tiempo, al momento de la plantación.\n- Se podría incluir hasta un 10% de especies exóticas como parte de la sostenibilidad reforestación. Esta subactividad dependerá del tipo de ecosistema y de la especie empleada."]
[]
[]
[null,"Labores culturales a plantones establecidos"]
[null,"Consideraciones\nDespués de realizar la plantación se debe manejar y proteger, para generar beneficios hacia el largo plazo. Así, se recomienda tomar en cuenta que el crecimiento del plantón, independientemente de la especie, está en un rango entre 6 y 8 meses de establecida la plantación. Luego, la mayor parte de proyectos revisados evalúan la ejecución de sus metas físicas en un periodo de 3 a 4 años.\n\nEntre las principales subactividades culturales a realizar se encuentran:"]
[null,"Riego\nDependiendo de la ubicación y la extensión de las temporadas de lluvia/sequía, para realizar esta subactividad considerar las siguientes recomendaciones:\n \n- Regar en los meses de febrero, marzo y abril.\n- Aplicar entre 4 y 5 litros de agua por planta y según el tipo de reforestación. Esto puede variar según las necesidades de la especie\n- La aplicación debe hacerse con cuidado y lentamente para no descubrir las raíces. Además, se debe permitir la absorción del agua por parte del suelo.\n- Optar, según las condiciones del terreno, el tipo de plantación y las especies utilizadas el tipo de riego: por goteo, por gravedad, con pivotes, entre otros)."]
[null,"Control de plantas invasoras\nEs importante realizar el control de maleza, previa instalación de la plantación, para que sean tan solo los árboles los que aprovechen la humedad. \n \nTemporalidad de la intervención: \n- Su frecuencia varía según la rapidez del crecimiento de la maleza. Se recomienda, dependiendo de la zona, realizarse al menos los dos o tres primeros años de instalada la plantación. \n- En el caso de deshierbes, se hacen en dos épocas en particular: (i) en época lluviosa, cuando las malezas crecen agresivamente, y rápidamente cubren los árboles y los deforman o pueden incluso matarlos; y (ii) al final de las lluvias, ya que así́ los árboles inician la época de sequia sin competencia."]
[null,"Replante\nEl replante se debe realizar cuando exista entre el 10% y 20% de mortandad entre los plantones. Normalmente, este se realiza entre 30 y 40 días de haber establecido la plantación, nunca después de un año. Es necesaria la selección de plantas más resistentes y las especies adecuadas, según el tipo de plantación, para la ejecución de esta actividad."]
[null,"Raleo\nEs importante reconocer los siguientes criterios para realizar la subactividad:\n- Cuando las copas de los árboles son muy pequeñas y sus ramas chocan entre si.\n- Cuando existan plantones enfermos, defectuosos y mal formados.\n- Cuando exista poca penetración de luz solar.\nSe recomienda realizarlo cuando los plantones posean una altura entre 7m y 9m. Así, el primer raleo deberá realizarse al primer año de instalada la plantación y así sucesivamente cada dos años."]
[null,"Poda\nLa poda tiene como finalidad la eliminación de las ramas para lograr obtener madera libre de nudos y de calidad. \n \nIndumentaria usada: Esta se realiza con la ayuda de serruchos (ramas de 4 a 5 cm de diámetro), sierras y machetes bien afilados. Utilizando el machete se hace en dos cortes, el primer corte se hace de abajo hacia arriba para evitar que el peso de la rama raje la corteza, y el segundo de arriba hacia abajo para dejar liso el corte."]
[]
[]
[null,"II. REVEGETACIÓN CON ESPECIES NATIVAS"]
[]
[null,"Siembra de especies herbáceas seleccionados"]
[null,"Temporalidad de la intervención\nLa siembra de especies herbáceas se realiza principalmente durante la época de estiaje. Además, a manera de recomendación se debe sembrar inmediatamente después de una semana seguida de lluvias, que puede ser desde la segunda quincena de diciembre hasta primeros quince días de enero. No se recomienda siembras en febrero.\n \nSin embargo, la temporalidad dependerá del tipo de ecosistema y la especie seleccionada."]
[null,"Preparación del terreno\nLa preparación del terreno significa realizar diferentes actividades como: roturado del terreno, cruza, desterroneo, cantoneo, nivelación y melgueo; con la finalidad que la semilla de los pastos tenga buena germinación y de esa manera tener buena cobertura y producción de pastos."]
[null,"Selección de sistema de siembra\nUna vez preparado el terreno, según la disponibilidad de mano de obra y el tipo de especie seleccionada, se pueden realizar los siguientes sistemas de siembra:\n \nSiembra al Voleo: Se realiza a mano dejando caer la semilla en forma constante y uniforme; es importante tener en cuenta la dirección del viento.\nSiembra en Líneas: Se realiza a mano, utilizando surcos o meglas que se hacen previamente o con el uso de yunta.\nSiembra Mecánica: Se realiza utilizando sembradora traccionada por tractor.\n\nA manera de recomendación, debido a la mayor infiltración del agua y mejor distribución de la cobertura vegetal, se recomienda la siembra a partir de un sistema de líneas."]
[null,"Plantación de esquejes\nEn caso se use el sistemas de plantación de esquejes mediante líneas, considerar:\n \nSistema por surcos: Se recomienda un distanciamiento de 40 cm entre surcos y 30 cm entre esquejes en promedio. \nSistema de melgas: se recomienda una distancia de 40 cm entre líneas y a 30 cm entre esquejes. \n \nA manera preliminar, la irrigación del terreno debe ser inmediatamente luego de terminar con la instalación (considerar mantener el suelo húmedo). Además, considerar realizar esta actividad al inicio de la temporada de lluvias para facilitar el prendimiento y reducir el costo de mano de obra en irrigación."]
[]
[null,"Labores culturales a pastizales"]
[null,"Riego\n\nTemporalidad de la actividad: \nEs necesario contar con agua durante todo el año, más aún durante los periodos de estiaje. \nSi las lluvias son irregulares, inclusive, se deben hacer riegos intensivos (bajo el sistema que correspondiera a la intervención), en un periodo de 8 días durante los primeros dos meses. Posterior a la plantación de esquejes, el riego debe hacerse cada 15 días durante el primer año de instalación. En periodos posteriores se pueden distanciar más las fechas de riego."]
[null,"Deshierbe\nEsta actividad consiste en la eliminación de malezas que compiten por agua, nutrientes, luz, espacio, entre otras. Para su realización, se considera el empleo de carretilla, picota, palana e instrumentos de uso manual. \n \nEsta actividad debe complementarse con el uso de cercos (con alambres o mallas protectoras) frente a actividades de sobrepastoreo en épocas de estiaje."]
[null,"Revisión de raíces\nEs necesario revisar las raíces de la plantación para asegurar que se encuentran captando de manera adecuada el agua y el abono utilizado. En caso existan raíces en mal estado que puedan comprometer al crecimiento del pastizal, se deben podar mediante el uso de una pequeña tijera."]
[]
[]
[null,"III. INSTALACIÓN DE CERCOS EXCLUIDORES"]
[]
[null,"Trazo y marcación"]
[null,"Para el trazado y marcación del terreno se recomienda:\n- Considerar las características topográfica y la fisiografía de la zona andina a intervenir. \n- La marcación del espacio, considera una separación entre marcas de 5 metros. A partir de esto, el espacio a cubrir es medido por el número de marcas por Km."]
[]
[null,"Apertura de hoyos"]
[null,"Esta actividad se mide por la cantidad de hoyos aperturados por jornal en el día. Considerar los siguientes criterios técnicos:\n \n- Apertura de hoyos en un espacio cuadrado que ronda los 20 cm por lado y 50 cm de profundidad de manera estándar, es decir, superar la capa orgánica del suelo de aproximadamente 20 cm hasta llegar al subsuelo. \n- Considerar que los hoyos de las esquinas del terreno deben tener mayores dimensiones: 40 cm de diámetro y entre 60 y 70 cm de profundidad. \n \nIndumentaria a usar: Ambos puntos requieren el uso de palana, carretilla y piqueta."]
[]
[null,"Traslado y plantado de postes"]
[null,"Para el traslado e instalación de postes de madera, se deberá considerar los siguientes criterios: \n\nCondiciones de acceso hacia cada zona\nEn caso no existan rutas pavimentadas, el trabajo de traslado se realizará mediante el uso de animales de carga, o de vehículos para el transporte de mayor cantidad de postes. \nEste trabajo debe hacerse en colaboración con los comuneros de la zona, por lo que la unidad de medida a considerar es el número de postes trasladados por jornal.\n \nIndumentaria a usar\n - Postes rollizos de madera o de otro material, preservados con tratamiento de brea en la base. \n- Las dimensiones de estos postes deben ser de 4\" de grosor, por 2 metros de largo. \n- Se sugiere el uso de piedra, adobe, tapiales o champas. Además de mallas ganaderas de alambre (9 a 10 hilos), filas de alambre galvanizado, de alambre de púa o con geo mallas, entre otros.\n \nInstalación de malla ganadera\n- Enterrar la base cubierta de brea (se recomienda 3 bloques de brea) de los postes de madera a 80 cm de profundidad, a un distanciamiento entre 5 y 7 metros.\n- Colocar los rollos de malla ganadera alrededor de los postes instalados. La altura de malla ganadera deberá ser aproximadamente de 0.9 m.\n- Usar las grapas para poder fijar la malla a la madera (grapas de 1.5 pulgadas).\n- Usar piedras o cemento para las esquinas y brindar estabilidad al cerco.\n- Usar sogas y un tensador.\n \nRecomendaciones adicionales\nSe recomienda colocar piedras para garantizar su estabilización y evitar rellenar el espacio faltante con tierra para prevenir la podredumbre de la madera. Los postes deben de colocarse en hileras rectas considerando el distanciamiento de marcación realizados con anterioridad."]
[]
[null,"IV. CONSTRUCCIÓN DE TERRAZAS DE FORMACIÓN DE SUELOS"]
[null,"Las terrazas altoandinas son franjas secuenciales que dividen la ladera en secciones perpendiculares a la pendiente, cuyos límites superiores e inferiores están orientados según las curvas a nivel y se encuentran protegidas por muros de piedra (pircas) o bordes de tierra, según su tipo de construcción. Esta acción está destinada para la recuperación de suelos degradados por lo que se recomienda el uso de pircas para su construcción."]
[]
[null,"Trazo y marcación"]
[null,"- Se realiza primero la verificación de la pendiente del terreno. \nPara ello, se utiliza un palo de un metro de largo colocado al nivel el suelo y se mide el desnivel, el cual no debe ser mayor a 1%. \n\n- Se marcan “líneas maestras” en donde se construirán las terrazas y se dará el levantamiento de muros.\n\nRecomendaciones generales\n- Las distancias entre los muros no deben ser menores a 5 m, pues la mayoría de las familias utilizan la tracción animal (yunta) para la labranza, lo que dificultaría esta actividad. \n- Recordar que a mayor nivel de pendiente, menor debe ser el distanciamiento de los muros, pero se debe incrementar su altura.\n- Esta actividad puede ser complementada con las instalación de barreras vivas que dependerá del tipo de ecosistema y los requerimientos de agua y suelo por especie."]
[null,"Pendiente del terreno (%)",null,"Distancia entre muros (m)",null,null,null,"Altura del muro (m)"]
[null,10,null,9.3000000000000007,null,null,null,0.99]
[null,15,null,7.3,null,null,null,1.1000000000000001]
[null,20,null,6.3,null,null,null,1.26]
[null,25,null,5.7,null,null,null,1.43]
[null,30,null,5.3,null,null,null,1.6]
[null,35,null,5,null,null,null,1.77]
[]
[null,"Remoción de tierra fértil"]
[null,"Mediante el uso de material nivel tipo “A”: picota, palas y carretilla, la construcción se inicia con la remoción de una franja de tierra de 0.60 m de ancho y 0.80 m de profundidad aproximadamente. Así, con el suelo removido se forma el camellón de la terraza, aguas arriba de la línea de nivel."]
[]
[null,"Compactación del borde de terraza"]
[null,"Luego, se debe afirmar la tierra sobre el camellón para prevenir la escorrentía del suelo y evitar desbordes por las altas precipitaciones en épocas de lluvia. Se debe abrir una pequeña zanja sobre la curva de nivel para la compactación de las piedras. Esta debe tener por lo menos un ancho de 40 cm."]
[]
[null,"Emparejamiento de la terraza"]
[null,"- Cuando se utiliza champa, debe construirse un cimiento con una base mínima de 50 cm. \n- El camellón de tierra debe ser levantado hasta la altura que permite la masa de suelo excavada, recomendándose alturas de hasta 1.50 m.  \n- Se debe reforzar la terraza con plantaciones de pastos, arbustos o forestales, dependiendo de la zona de localización, en la parte superior de esta con el fin de prevenir relaves y escorrentía por la pendiente. \n- El pasto se debe plantar a una distancia de un pie (20 a 30 cm), los arbustos de 30 cm y las especies forestales en una distancia estándar de 3mx3m."]
[]
[null,"Mantenimiento de terraza andina"]
[null,"Las terrazas construidas con muros de tierra necesitan de un mantenimiento de tres veces por año (principalmente deben ser aprovechadas durante la época de estiaje), hasta lograr su completa estabilización y puedan cumplir así con su función de retención del agua y sedimentos hasta concluir su formación. Eso supone el uso de por lo menos 8 jornales al año. Las principales actividades requieren la reposición de la tierra debilitada y de las piedras de la base.\n \nEn caso de que la terraza sea construida con muros de piedra, se debe reponer las piedras caídas para no alterar la estructura de la terraza y aumentar la altura de las piedras en épocas de lluvia."]
[]
[]
[null,"V. REPARACIÓN DEL CANAL AMUNADOR"]
[null,"Las amunas son canales que infiltran el agua de lluvia y recargan los acuíferos. Los reservorios regulados incrementan la disponibilidad hídrica en la cuenca para la recuperación del ecosistema y de apoyo a la provisión el servicio ecosistémico de regulación hídrica."]
[]
[null,"Construcción de dique y estructura de captación"]
[null,"Para poder proteger a la amuna de la erosión del suelo por las altas precipitaciones y lograr una mayor infiltración del agua, así como controlar la escorrentía del suelo, se sugiere la construcción de una represa de derivación (dique) y de una estructura de captación. La presa es con muro de tierra y núcleo de concreto protegido con concreto ciclópeo tipo enrocado, ubicada en una quebrada con toma de captación y desarenador, para la captación de aguas pluviales.\n \nLuego, para el caso de la estructura de captación, se determina hacia el final de la amuna, una quebrada donde se entrega el agua para que esta infiltre. Mayormente es una zona de roca fracturada con buena capacidad de infiltración y conductividad hidráulica. También puede ser una zona adecuadamente protegida para una nueva captación y almacenamiento superficial."]
[]
[null,"Mejoramiento de canal amunador"]
[null,"A partir de los estudios y la identificación del canal amunadora, se debe instalar un sistema de conducción para el recurso hídrico. En la experiencia de Tupichocha fueron tuberías de polietileno de alta densidad, ubicados en la parte alta a la cabera de chacra para su distribución mediante compuertas laterales."]
[]
[null,"Instalación de área de protección"]
[null,"Se recomienda la instalación de pastos y bosques en la cabecera de la quebrada, con el fin de disminuir el escurrimiento del agua. Esta actividad debe realizarse antes de la temporada de lluvias y debe ser complementada con estrategias de protección contra el sobrepastoreo."]
[]
[]
[null,"VI. REPARACIÓN DEL CANAL DE MAMANTEO"]
[null,"El mamanteo es una técnica que consiste en derivar el agua de las quebradas a través de canales y verterlas en suelos con alta capacidad de infiltración. Esta práctica busca aumentar la infiltración del agua en el suelo, durante la época de lluvia; para que durante la época de sequía, el agua infiltrada resurja en los manantiales. Además, esta acción permite la recuperación de ecosistemas degradados por falta de agua, sean pajonales, bofedales, entre otros y apoya a la provisión el servicio ecosistémico de regulación hídrica."]
[]
[null,"Descolmatación de canales"]
[null,"A partir de determinar la extensión de los canales de mamanteo, se sugiere realizar la limpieza o descolmatación de sedimentos y residuos que se encuentren en su recorrido. Para ello, se recomienda la coacción con los comuneros y el uso de palanas y carretillas o animales de carga para el transporte de estos desechos."]
[]
[null,"Reconstrucción e impermeabilización de canales de mamanteo"]
[null,"Se construirá una captación al inicio de cada canal de mamanteo con la finalidad de aumentar la cantidad de volumen que ingresa a los canales. Luego, impermeabilizar las primeras secciones de los canales, con la finalidad de asegurar que la mayor cantidad de agua que es conducida por el canal llegue a la zona de infiltración, lo que se significa mayor cantidad de agua infiltrada y mayor cantidad de agua en los manantiales."]
[]
[null,"Instalación de medidas de protección"]
[null,"Se hace necesario proteger los canales de mamanteo, a partir de la instalación de cobertura vegetal en cabecera de cuenca. Con ello, se logra una disminución en la escorrentía y en la acumulación de sedimentos. Para realizar esta actividad, se recomienda: \n \nIndumentaria a usar: Para la instalación de barreras vivas es necesario el trazo de curva a nivel, mediante el uso de instrumentos nivel en “A” (estacas, palana, machete, piocha, entre otras).\n \nTamaño: Las curvas de nivel debe trazarse y tener un distanciamiento entre curvas de 30 a 40 cm. Luego, se pica la tierra con una dimensión de 30 cm x 30 cm y se procede a sembrar el cultivo seleccionado."]
[]
[]
[null," VII. CONSTRUCCIÓN DE ZANJAS DE INFILTRACIÓN"]
[null,"Las zanjas de infiltración son pequeños canales de forma rectangular, cuya finalidad es retener el agua de escorrentía, que proviene de las partes altas del terreno, para que rompa la velocidad del agua, de tal manera que se capte y acumule en la zanja, para que sirva de reserva a los árboles y cultivos. El incremento de la disponibilidad de agua está destinado para la recuperación del ecosistema y de apoyo a la provisión el servicio ecosistémico de regulación hídrica."]
[]
[null,"Trazo, niveles y replante preliminar"]
[null,"- Se trazan las líneas a nivel (guía para excavar las zanjas) con ayuda del nivel “A” o nivel de  caballete, empezando siempre de la parte más alta de la ladera.\n- Se demarcan las líneas con ayuda de estacas o el pico, cavando un surco superficial que marque bien cada curva.\n- Se trasplanta pasto o cabuya a ambos lados de la zanja para protegerla."]
[]
[null,"Excavación de zanjas de infiltración"]
[null,"Se excava la zanja, teniendo en cuenta las dimensiones indicadas (ancho de la base: 40 cm, altura o profundidad: 40 cm)."]
[]
[null,"Compactación del terreno"]
[null,"Una vez excavada la zanja con las medidas ya indicadas se procede a nivelación cuidadosa de la base o fondo de la zanja con ayuda del nivel en “A”. Todo el material extraído de la excavación de la zanja se coloca en su borde inferior, apisonando capa por capa, formando un bordo o camellón. \n \nRecomendaciones generales\n- Las zanjas no deben ser mayor a 200 m de largo.\n- Construir de diques o tabiques cada cierto trecho. De esta manera, la zanja queda dividida en secciones que regulan el almacenamiento de agua para las diferentes partes de la plantación. Sirve en terrenos de alta inclinación.",null,null,null,null,null,null,null,null,null,null,null,null,null," "]
[]
[null,"INSTALACIÓN DE QOCHAS"]
[null,"Las qochas son pequeños depósitos de agua, que retienen y represan el agua de lluvia. A través de una lenta infiltración permiten recargar permanentemente las aguas subterráneas, manteniendo las manantes aguas abajo. El incremento de la disponibilidad de agua está destinado para la recuperación del ecosistema y de apoyo a la provisión el servicio ecosistémico de regulación hídrica."]
[]
[null,"Construcción de diques"]
[null,"Para garantizar de manera natural la reconstrucción o reposición natural del sistema de qochas, se recomienda la construcción de diques por qocha, a partir de la remoción de tierra compactada que permita contener parte del agua como excedente en el periodo de lluvias. \n \nDimensiones de diques\nLas dimensiones del dique estarán en función de la altura del espejo de agua y de la pendiente del terreno. Se recomienda construir diques de 1,00 m. de altura en promedio, con un ancho en la corona de 0.50 m y una base de 2.50 m. El ancho de la base del dique está en función de la altura del dique, del material a utilizar y del talud que se le dará a las paredes del muro. Para diques mayores de 1,50 m. de altura se requiere realizar estudios especializados.\n \nProceso de construcción\n - Colocar una primera capa con piedras grandes en la base y en las caras externa e interna del dique. Rellenar la parte central con piedras más pequeñas y compactarla con arcilla o arena. \n- Colocar la segunda capa con piedras grandes en ambas caras y rellenar la parte central del dique con piedras pequeñas y tierra arcillosa, compactando para impermeabilizar y evitar la pérdida de agua por filtración. Repetir este paso hasta llegar a la altura final del dique. \n- Cubrir con piedras planas la cara interna del dique, para evitar la erosión y disminuir la infiltración.\n- Echar tierra negra y estiércol en la cara externa y superior del dique, para garantizar el prendimiento de los pastos de las champas.\n- Colocar champas con pastos vivos, en la cara externa y superior del dique. Esto le dará mayor solidez y evitará la erosión por las lluvias y el viento. "]

{"sheet":"COSTOS UNITARIOS","index":48,"n_rows":248,"n_cols":23,"rows_kept":248,"cut":false,"hidden":false,"merged":[[46,15,46,16],[47,15,47,16],[46,18,46,19],[46,20,46,21],[46,22,46,23],[47,18,47,19],[47,20,47,21],[47,22,47,23],[190,8,190,14],[189,22,189,23],[180,18,180,19],[180,20,180,21],[180,22,180,23],[181,8,181,14],[185,18,185,19],[185,20,185,21],[185,22,185,23],[186,8,186,14],[186,18,186,19],[186,20,186,21],[186,22,186,23],[183,8,183,14],[183,18,183,19],[183,20,183,21],[131,19,132,20],[189,18,189,19],[189,20,189,21],[67,20,67,21],[68,20,68,21],[69,20,69,21],[177,8,177,14],[178,8,178,14],[179,20,179,21],[167,8,167,14],[167,15,168,16],[167,18,167,19],[167,20,167,21],[163,8,163,14],[155,8,155,14],[155,18,155,19],[155,20,155,21],[152,8,152,14],[152,18,152,19],[168,8,168,14],[168,18,168,19],[169,20,169,21],[166,8,166,14],[166,18,166,19],[155,22,155,23],[152,20,152,21],[152,22,152,23],[180,8,180,14],[180,15,183,16],[182,22,182,23],[179,8,179,14],[179,18,179,19],[172,22,172,23],[174,8,174,14],[174,18,174,19],[174,20,174,21],[174,22,174,23],[173,8,173,14],[173,15,174,16],[173,18,173,19],[173,20,173,21],[173,22,173,23],[167,22,167,23],[168,20,168,21],[168,22,168,23],[169,8,169,14],[169,15,169,16],[169,18,169,19],[246,15,246,16],[246,17,246,18],[247,15,247,16],[247,17,247,18],[244,15,244,16],[244,17,244,18],[245,15,245,16],[245,17,245,18],[69,22,69,23],[176,22,176,23],[183,22,183,23],[184,18,184,19],[184,20,184,21],[184,22,184,23],[165,18,165,19],[165,20,165,21],[165,22,165,23],[158,22,158,23],[154,22,154,23],[141,20,141,21],[141,22,141,23],[140,20,140,21],[177,18,177,19],[177,20,177,21],[243,15,243,16],[243,17,243,18],[238,1,238,7],[238,8,238,14],[238,15,238,16],[238,17,238,18],[239,1,239,7],[239,8,239,14],[239,15,239,16],[239,17,239,18],[241,17,242,18],[237,15,237,16],[237,17,237,18],[235,1,235,7],[235,8,235,14],[235,15,235,16],[235,17,235,18],[240,1,240,7],[240,8,240,14],[240,15,240,16],[240,17,240,18],[236,8,236,14],[236,15,236,16],[212,1,222,7],[212,8,212,14],[212,15,212,16],[212,18,212,19],[212,20,212,21],[212,22,212,23],[220,20,220,21],[220,22,220,23],[221,8,221,14],[221,15,222,16],[221,18,221,19],[217,8,217,14],[217,15,218,16],[217,18,217,19],[217,20,217,21],[217,22,217,23],[218,8,218,14],[221,20,221,21],[221,22,221,23],[222,8,222,14],[222,18,222,19],[222,20,222,21],[218,18,218,19],[218,20,218,21],[218,22,218,23],[219,8,219,14],[219,15,220,16],[219,18,219,19],[219,20,219,21],[219,22,219,23],[220,8,220,14],[220,18,220,19],[222,22,222,23],[213,22,213,23],[214,8,214,14],[214,18,214,19],[214,20,214,21],[214,22,214,23],[215,8,215,14],[215,15,216,16],[215,18,215,19],[215,20,215,21],[215,22,215,23],[213,8,213,14],[213,15,214,16],[213,18,213,19],[213,20,213,21],[216,8,216,14],[216,18,216,19],[216,20,216,21],[216,22,216,23],[210,8,210,14],[210,15,211,16],[210,18,210,19],[210,20,210,21],[210,22,210,23],[211,8,211,14],[211,18,211,19],[211,20,211,21],[211,22,211,23],[208,8,208,14],[208,15,209,16],[208,18,208,19],[208,20,208,21],[208,22,208,23],[209,8,209,14],[209,18,209,19],[209,20,209,21],[209,22,209,23],[201,22,201,23],[202,8,202,14],[206,8,206,14],[206,15,207,16],[206,18,206,19],[206,20,206,21],[206,22,206,23],[207,8,207,14],[207,18,207,19],[207,20,207,21],[207,22,207,23],[204,8,204,14],[204,15,205,16],[204,18,204,19],[204,20,204,21],[204,22,204,23],[205,8,205,14],[205,18,205,19],[205,20,205,21],[205,22,205,23],[201,15,203,16],[201,18,201,19],[199,8,199,14],[199,18,199,19],[199,20,199,21],[199,22,199,23],[194,8,194,14],[190,15,194,16],[190,22,190,23],[191,22,191,23],[196,20,196,21],[196,22,196,23],[192,22,192,23],[193,22,193,23],[194,22,194,23],[190,20,190,21],[191,20,191,21],[192,20,192,21],[193,20,193,21],[194,20,194,21],[190,18,190,19],[191,18,191,19],[192,18,192,19],[193,18,193,19],[194,18,194,19],[197,1,211,7],[197,8,197,14],[197,15,197,16],[197,18,197,19],[197,20,197,21],[197,22,197,23],[198,8,198,14],[198,15,200,16],[202,18,202,19],[202,20,202,21],[202,22,202,23],[203,8,203,14],[203,18,203,19],[203,20,203,21],[203,22,203,23],[200,8,200,14],[200,18,200,19],[200,20,200,21],[200,22,200,23],[201,8,201,14],[201,20,201,21],[198,18,198,19],[198,20,198,21],[198,22,198,23],[169,1,174,7],[195,8,195,14],[195,15,196,16],[195,18,195,19],[195,20,195,21],[195,22,195,23],[196,8,196,14],[196,18,196,19],[187,8,187,14],[187,18,187,19],[187,20,187,21],[187,22,187,23],[188,8,188,14],[188,15,189,16],[188,18,188,19],[188,20,188,21],[188,22,188,23],[189,8,189,14],[191,8,191,14],[192,8,192,14],[193,8,193,14],[172,8,172,14],[172,18,172,19],[172,20,172,21],[175,1,196,7],[175,8,175,14],[175,15,175,16],[175,18,175,19],[175,20,175,21],[175,22,175,23],[176,8,176,14],[176,15,179,16],[176,18,176,19],[176,20,176,21],[181,18,181,19],[181,20,181,21],[181,22,181,23],[182,8,182,14],[182,18,182,19],[182,20,182,21],[177,22,177,23],[178,18,178,19],[178,20,178,21],[178,22,178,23],[179,22,179,23],[184,8,184,14],[184,15,187,16],[185,8,185,14],[169,22,169,23],[170,8,170,14],[170,15,172,16],[170,18,170,19],[170,20,170,21],[170,22,170,23],[171,8,171,14],[171,18,171,19],[171,20,171,21],[171,22,171,23],[166,20,166,21],[166,22,166,23],[163,15,166,16],[163,18,163,19],[163,20,163,21],[163,22,163,23],[164,8,164,14],[164,18,164,19],[164,20,164,21],[164,22,164,23],[165,8,165,14],[162,8,162,14],[162,18,162,19],[162,20,162,21],[162,22,162,23],[159,8,159,14],[159,18,159,19],[159,20,159,21],[159,22,159,23],[160,8,160,14],[160,15,162,16],[160,18,160,19],[160,20,160,21],[160,22,160,23],[161,8,161,14],[153,1,168,7],[153,8,153,14],[153,15,153,16],[153,18,153,19],[153,20,153,21],[153,22,153,23],[154,8,154,14],[154,15,159,16],[154,18,154,19],[154,20,154,21],[157,8,157,14],[157,18,157,19],[157,20,157,21],[157,22,157,23],[158,8,158,14],[158,18,158,19],[158,20,158,21],[161,18,161,19],[161,20,161,21],[161,22,161,23],[156,8,156,14],[156,18,156,19],[156,20,156,21],[156,22,156,23],[147,1,152,7],[147,8,147,14],[148,18,148,19],[148,20,148,21],[148,22,148,23],[149,8,149,14],[149,18,149,19],[149,20,149,21],[149,22,149,23],[150,8,150,14],[150,18,150,19],[150,20,150,21],[150,22,150,23],[151,8,151,14],[151,15,152,16],[151,18,151,19],[151,20,151,21],[151,22,151,23],[147,15,147,16],[147,18,147,19],[147,20,147,21],[147,22,147,23],[148,8,148,14],[148,15,150,16],[142,18,142,19],[142,20,142,21],[142,22,142,23],[143,8,143,14],[145,8,145,14],[145,15,146,16],[145,18,145,19],[145,20,145,21],[145,22,145,23],[146,8,146,14],[146,18,146,19],[146,20,146,21],[146,22,146,23],[140,22,140,23],[137,1,146,7],[137,8,137,14],[137,15,137,16],[137,18,137,19],[137,20,137,21],[137,22,137,23],[138,8,138,14],[138,15,140,16],[138,18,138,19],[138,20,138,21],[140,8,140,14],[140,18,140,19],[143,18,143,19],[143,20,143,21],[143,22,143,23],[144,8,144,14],[144,18,144,19],[144,20,144,21],[144,22,144,23],[141,8,141,14],[141,15,144,16],[141,18,141,19],[142,8,142,14],[135,1,136,7],[135,8,136,14],[135,15,136,16],[135,17,135,19],[135,20,136,21],[135,22,136,23],[136,18,136,19],[138,22,138,23],[139,8,139,14],[139,18,139,19],[139,20,139,21],[139,22,139,23],[122,17,122,18],[123,17,123,18],[120,17,120,18],[121,17,121,18],[123,1,123,14],[120,1,120,14],[121,1,121,14],[122,1,122,14],[120,15,123,16],[119,15,119,16],[119,17,119,18],[114,1,114,7],[114,8,114,14],[114,15,114,16],[114,17,114,18],[115,1,115,7],[115,8,115,14],[115,15,115,16],[115,17,115,18],[117,17,118,18],[119,1,119,14],[117,1,118,16],[113,15,113,16],[113,17,113,18],[111,1,111,7],[111,8,111,14],[111,15,111,16],[111,17,111,18],[116,1,116,7],[116,8,116,14],[116,15,116,16],[116,17,116,18],[113,1,113,7],[113,8,113,14],[110,15,110,16],[110,17,110,18],[105,18,105,19],[106,1,106,23],[105,20,105,21],[105,22,105,23],[112,1,112,7],[112,8,112,14],[112,15,112,16],[112,17,112,18],[110,1,110,7],[110,8,110,14],[104,18,104,19],[104,20,104,21],[104,22,104,23],[103,18,103,19],[103,20,103,21],[103,22,103,23],[108,1,109,7],[108,8,109,14],[108,15,109,16],[108,17,109,18],[104,1,104,14],[105,1,105,14],[96,8,96,14],[96,15,97,16],[96,18,96,19],[92,8,92,14],[92,15,93,16],[92,18,92,19],[92,20,92,21],[92,22,92,23],[93,8,93,14],[96,20,96,21],[96,22,96,23],[97,8,97,14],[93,18,93,19],[93,20,93,21],[93,22,93,23],[94,8,94,14],[94,15,95,16],[94,18,94,19],[94,20,94,21],[94,22,94,23],[95,8,95,14],[95,18,95,19],[102,18,102,19],[102,20,102,21],[102,22,102,23],[97,22,97,23],[101,15,101,16],[101,18,101,19],[101,20,101,21],[101,22,101,23],[97,18,97,19],[97,20,97,21],[99,17,99,19],[99,20,100,21],[99,22,100,23],[100,18,100,19],[99,1,100,16],[102,15,105,16],[87,1,97,7],[87,8,87,14],[87,15,87,16],[87,18,87,19],[87,20,87,21],[87,22,87,23],[95,20,95,21],[95,22,95,23],[88,22,88,23],[89,8,89,14],[89,18,89,19],[89,20,89,21],[89,22,89,23],[90,8,90,14],[90,15,91,16],[90,18,90,19],[90,20,90,21],[90,22,90,23],[88,8,88,14],[88,15,89,16],[88,18,88,19],[88,20,88,21],[91,8,91,14],[91,18,91,19],[91,20,91,21],[91,22,91,23],[85,8,85,14],[85,15,86,16],[85,18,85,19],[85,20,85,21],[85,22,85,23],[86,8,86,14],[86,18,86,19],[86,20,86,21],[86,22,86,23],[83,8,83,14],[83,15,84,16],[83,18,83,19],[83,20,83,21],[83,22,83,23],[84,8,84,14],[84,18,84,19],[84,20,84,21],[84,22,84,23],[77,8,77,14],[81,8,81,14],[81,15,82,16],[81,18,81,19],[81,20,81,21],[81,22,81,23],[82,8,82,14],[82,18,82,19],[82,20,82,21],[82,22,82,23],[79,8,79,14],[79,15,80,16],[79,18,79,19],[79,20,79,21],[79,22,79,23],[80,8,80,14],[80,18,80,19],[80,20,80,21],[80,22,80,23],[73,20,73,21],[73,22,73,23],[74,8,74,14],[74,18,74,19],[74,20,74,21],[74,22,74,23],[71,20,71,21],[71,22,71,23],[76,22,76,23],[72,1,86,7],[72,8,72,14],[72,15,72,16],[72,18,72,19],[72,20,72,21],[72,22,72,23],[73,8,73,14],[73,15,75,16],[77,18,77,19],[77,20,77,21],[77,22,77,23],[78,8,78,14],[78,18,78,19],[78,20,78,21],[78,22,78,23],[75,8,75,14],[75,18,75,19],[75,20,75,21],[75,22,75,23],[76,8,76,14],[76,15,78,16],[76,18,76,19],[76,20,76,21],[73,18,73,19],[70,8,70,14],[70,15,71,16],[70,18,70,19],[70,20,70,21],[70,22,70,23],[71,8,71,14],[71,18,71,19],[65,8,65,14],[66,8,66,14],[67,8,67,14],[68,8,68,14],[69,8,69,14],[65,18,65,19],[66,18,66,19],[67,18,67,19],[68,18,68,19],[69,18,69,19],[65,20,65,21],[66,20,66,21],[65,15,69,16],[65,22,65,23],[66,22,66,23],[67,22,67,23],[68,22,68,23],[63,8,63,14],[63,15,64,16],[63,18,63,19],[63,20,63,21],[63,22,63,23],[64,8,64,14],[64,18,64,19],[64,20,64,21],[64,22,64,23],[60,18,60,19],[60,20,60,21],[60,22,60,23],[61,8,61,14],[61,18,61,19],[61,20,61,21],[61,22,61,23],[58,8,58,14],[58,18,58,19],[58,20,58,21],[58,22,58,23],[59,8,59,14],[59,15,62,16],[59,18,59,19],[59,20,59,21],[59,22,59,23],[60,8,60,14],[62,8,62,14],[62,18,62,19],[62,20,62,21],[62,22,62,23],[54,18,54,19],[54,20,54,21],[54,22,54,23],[55,8,55,14],[55,15,58,16],[51,22,51,23],[52,8,52,14],[52,18,52,19],[52,20,52,21],[52,22,52,23],[53,8,53,14],[53,18,53,19],[53,20,53,21],[53,22,53,23],[55,18,55,19],[55,20,55,21],[55,22,55,23],[56,8,56,14],[48,20,48,21],[48,22,48,23],[49,8,49,14],[49,18,49,19],[49,20,49,21],[49,22,49,23],[50,1,71,7],[50,8,50,14],[50,15,50,16],[50,18,50,19],[50,20,50,21],[50,22,50,23],[51,8,51,14],[51,15,54,16],[51,18,51,19],[51,20,51,21],[56,18,56,19],[56,20,56,21],[56,22,56,23],[57,8,57,14],[57,18,57,19],[57,20,57,21],[57,22,57,23],[54,8,54,14],[42,1,49,7],[42,8,42,14],[42,15,42,16],[42,18,42,19],[42,20,42,21],[42,22,42,23],[43,8,43,14],[43,15,45,16],[43,18,43,19],[43,20,43,21],[46,8,46,14],[47,8,47,14],[43,22,43,23],[44,8,44,14],[44,18,44,19],[44,20,44,21],[44,22,44,23],[45,8,45,14],[45,18,45,19],[45,20,45,21],[45,22,45,23],[48,8,48,14],[48,15,49,16],[48,18,48,19],[40,8,40,14],[40,15,41,16],[40,18,40,19],[40,20,40,21],[40,22,40,23],[41,8,41,14],[41,18,41,19],[41,20,41,21],[41,22,41,23],[38,18,38,19],[38,20,38,21],[38,22,38,23],[39,8,39,14],[39,18,39,19],[39,20,39,21],[39,22,39,23],[36,8,36,14],[36,15,39,16],[36,18,36,19],[36,20,36,21],[36,22,36,23],[37,8,37,14],[37,18,37,19],[37,20,37,21],[37,22,37,23],[38,8,38,14],[31,22,31,23],[27,22,27,23],[28,8,28,14],[28,18,28,19],[28,20,28,21],[28,22,28,23],[29,8,29,14],[29,18,29,19],[29,20,29,21],[29,22,29,23],[35,8,35,14],[35,18,35,19],[35,20,35,21],[35,22,35,23],[32,8,32,14],[32,18,32,19],[32,20,32,21],[32,22,32,23],[33,8,33,14],[33,15,35,16],[33,18,33,19],[33,20,33,21],[33,22,33,23],[34,8,34,14],[25,8,25,14],[25,18,25,19],[25,20,25,21],[25,22,25,23],[26,1,41,7],[26,8,26,14],[26,15,26,16],[26,18,26,19],[26,20,26,21],[26,22,26,23],[27,8,27,14],[27,15,32,16],[27,18,27,19],[27,20,27,21],[30,8,30,14],[30,18,30,19],[30,20,30,21],[30,22,30,23],[31,8,31,14],[31,18,31,19],[31,20,31,21],[34,18,34,19],[34,20,34,21],[34,22,34,23],[20,1,25,7],[20,8,20,14],[20,15,20,16],[20,18,20,19],[20,20,20,21],[20,22,20,23],[21,8,21,14],[23,20,23,21],[23,22,23,23],[21,15,23,16],[21,18,21,19],[21,20,21,21],[21,22,21,23],[22,8,22,14],[22,18,22,19],[22,20,22,21],[22,22,22,23],[23,8,23,14],[23,18,23,19],[24,8,24,14],[24,15,25,16],[24,18,24,19],[24,20,24,21],[24,22,24,23],[12,22,12,23],[15,20,15,21],[15,22,15,23],[17,8,17,14],[17,18,17,19],[17,20,17,21],[17,22,17,23],[18,8,18,14],[18,15,19,16],[18,18,18,19],[18,20,18,21],[18,22,18,23],[19,8,19,14],[19,18,19,19],[19,20,19,21],[19,22,19,23],[0,1,3,4],[8,1,9,7],[8,8,9,14],[8,15,9,16],[8,17,8,19],[8,20,9,21],[13,8,13,14],[13,18,13,19],[13,20,13,21],[7,1,7,14],[11,8,11,14],[11,15,13,16],[11,18,11,19],[11,20,11,21],[12,8,12,14],[12,18,12,19],[12,20,12,21],[8,22,9,23],[9,18,9,19],[10,1,19,7],[10,8,10,14],[10,15,10,16],[10,18,10,19],[10,20,10,21],[102,1,102,14],[103,1,103,14],[101,1,101,14],[10,22,10,23],[13,22,13,23],[16,8,16,14],[16,18,16,19],[16,20,16,21],[16,22,16,23],[14,8,14,14],[14,15,17,16],[14,18,14,19],[14,20,14,21],[14,22,14,23],[15,8,15,14],[15,18,15,19],[11,22,11,23],[245,1,245,14],[246,1,246,14],[247,1,247,14],[223,17,223,19],[223,20,224,21],[223,22,224,23],[224,18,224,19],[225,1,225,14],[226,15,226,16],[226,18,226,19],[226,20,226,21],[226,22,226,23],[225,15,225,16],[225,18,225,19],[225,20,225,21],[225,22,225,23],[229,20,229,21],[229,22,229,23],[228,15,228,16],[228,18,228,19],[228,20,228,21],[236,17,236,18],[223,1,224,16],[241,1,242,16],[226,1,226,14],[227,1,227,14],[228,1,228,14],[229,1,229,14],[243,1,243,14],[244,1,244,14],[228,22,228,23],[227,15,227,16],[227,18,227,19],[227,20,227,21],[227,22,227,23],[232,1,233,7],[232,8,233,14],[232,15,233,16],[232,17,233,18],[234,1,234,7],[234,8,234,14],[234,15,234,16],[234,17,234,18],[229,15,229,16],[229,18,229,19],[236,1,236,7],[237,1,237,7],[237,8,237,14]]}
[]
[]
[]
[]
[]
[]
[]
[null,"COSTOS A PRECIOS DE MERCADO"]
[null,"INDICADOR DE PRODUCTO",null,null,null,null,null,null,"DESCRIPCIÓN DE ACCIONES ",null,null,null,null,null,null,"TIPO DE FACTOR PRODUCTIVO",null,"UNIDAD DE PRODUCCIÓN",null,null,"COSTO UNITARIO EN SOLES",null,"COSTOS SUB TOTAL EN SOLES"]
[null,null,null,null,null,null,null,null,null,null,null,null,null,null,null,null,null,"UM","META"]
[null,{"$f":"'8.ANALISIS TÉCNICO'!E106","v":"HECTÁREAS DE COBERTURA VEGETAL INCREMENTADAS DEL ECOSISTEMA PRINCIPAL"},null,null,null,null,null,null,{"$f":"'8.ANALISIS TÉCNICO'!C73","v":"RECUPERACIÓN DE LA COBERTURA VEGETAL NATIVA DEL ECOSISTEMA PRINCIPAL"},null,null,null,null,null,null,{"$f":"IF(I11=\"\",\"\",\"Infraestructura natural\")","v":"Infraestructura natural"},null,{"$f":"IF(I11=\"\",\"\",\"HA\")","v":"HA"},null,null,null,null,{"$f":"W12+W15+W19","v":0}]
[null,null,null,null,null,null,null,null,{"$f":"'8.ANALISIS TÉCNICO'!D73","v":"REVEGETACIÓN CON ESPECIES NATIVAS"},null,null,null,null,null,null,{"$f":"'8.ANALISIS TÉCNICO'!H73","v":"Infraestructura Natural"},null,{"$f":"IF(I12=\"\",\"\",\"HA\")","v":"HA"},null,null,null,null,{"$f":"SUM(W13:X14)","v":0}]
[null,null,null,null,null,null,null,null,{"$f":"IF(I12=\"\",\"\",datos!C191)","v":"SIEMBRA DE ESPECIES HERBÁCEAS SELECCIONADAS"},null,null,null,null,null,null,null,null,{"$f":"IF(I13=\"\",\"\",datos!C203)","v":"HA"},null,null,null,null,{"$f":"U13*S13","v":0}]
[null,null,null,null,null,null,null,null,{"$f":"IF(I12=\"\",\"\",datos!C193)","v":"LABORES CULTURALES A ESPECIES HERBÁCEAS"},null,null,null,null,null,null,null,null,{"$f":"IF(I14=\"\",\"\",datos!C204)","v":"HORAS HOMBRE"},null,null,null,null,{"$f":"U14*S14","v":0}]
[null,null,null,null,null,null,null,null,{"$f":"'8.ANALISIS TÉCNICO'!D74","v":"INSTALACIÓN DE CERCOS EXCLUIDORES"},null,null,null,null,null,null,{"$f":"'8.ANALISIS TÉCNICO'!H74","v":"Infraestructura"},null,{"$f":"IF(I15=\"\",\"\",\"ML\")","v":"ML"},null,null,null,null,{"$f":"SUM(W16:X18)","v":0}]
[null,null,null,null,null,null,null,null,{"$f":"IF(I15=\"\",\"\",datos!D191)","v":"TRAZO Y MARCACIÓN"},null,null,null,null,null,null,null,null,{"$f":"IF(I16=\"\",\"\",datos!D203)","v":"ML"},null,null,null,null,{"$f":"U16*S16","v":0}]
[null,null,null,null,null,null,null,null,{"$f":"IF(I15=\"\",\"\",datos!D193)","v":"APERTURA DE HOYOS"},null,null,null,null,null,null,null,null,{"$f":"IF(I17=\"\",\"\",datos!D204)","v":"UNIDAD"},null,null,null,null,{"$f":"U17*S17","v":0}]
[null,null,null,null,null,null,null,null,{"$f":"IF(I15=\"\",\"\",datos!D195)","v":"TRASLADO DE PLANTADO DE POSTES"},null,null,null,null,null,null,null,null,{"$f":"IF(I18=\"\",\"\",datos!D205)","v":"ML"},null,null,null,null,{"$f":"U18*S18","v":0}]
[null,null,null,null,null,null,null,null,{"$f":"'8.ANALISIS TÉCNICO'!D75","v":"OTRO:"},null,null,null,null,null,null,{"$f":"'8.ANALISIS TÉCNICO'!H77","v":0},null,null,null,null,null,null,{"$f":"SUM(W20)","v":0}]
[null,null,null,null,null,null,null,null,{"$f":"'8.ANALISIS TÉCNICO'!M75","v":0},null,null,null,null,null,null,null,null,null,null,null,null,null,{"$f":"U20*S20","v":0}]
[null,{"$f":"'8.ANALISIS TÉCNICO'!E110","v":"HECTÁREAS DE LA ESTRUCTURA DE LA TURBA RECUPERADA DEL ECOSISTEMA PRINCIPAL"},null,null,null,null,null,null,{"$f":"'8.ANALISIS TÉCNICO'!C76","v":"RECUPERACIÓN DE LAS CARACTERÍSTICAS DE LA TURBA DEL ECOSISTEMA PRINCIPAL"},null,null,null,null,null,null,{"$f":"IF(I21=\"\",\"\",\"Infraestructura natural\")","v":"Infraestructura natural"},null,{"$f":"IF(I21=\"\",\"\",\"HA\")","v":"HA"},null,null,null,null,{"$f":"W22+W25","v":0}]
[null,null,null,null,null,null,null,null,{"$f":"'8.ANALISIS TÉCNICO'!D76","v":"REVEGETACIÓN CON ESPECIES NATIVAS"},null,null,null,null,null,null,{"$f":"'8.ANALISIS TÉCNICO'!H76","v":"Infraestructura Natural"},null,{"$f":"IF(I22=\"\",\"\",\"HA\")","v":"HA"},null,null,null,null,{"$f":"SUM(W23:X24)","v":0}]
[null,null,null,null,null,null,null,null,{"$f":"IF(I22=\"\",\"\",datos!C191)","v":"SIEMBRA DE ESPECIES HERBÁCEAS SELECCIONADAS"},null,null,null,null,null,null,null,null,{"$f":"IF(I23=\"\",\"\",datos!C203)","v":"HA"},null,null,null,null,{"$f":"U23*S23","v":0}]
[null,null,null,null,null,null,null,null,{"$f":"IF(I22=\"\",\"\",datos!C193)","v":"LABORES CULTURALES A ESPECIES HERBÁCEAS"},null,null,null,null,null,null,null,null,{"$f":"IF(I24=\"\",\"\",datos!C204)","v":"HORAS HOMBRE"},null,null,null,null,{"$f":"U24*S24","v":0}]
[null,null,null,null,null,null,null,null,{"$f":"'8.ANALISIS TÉCNICO'!D77","v":"OTRO:"},null,null,null,null,null,null,{"$f":"'8.ANALISIS TÉCNICO'!H77","v":0},null,null,null,null,null,null,{"$f":"SUM(W26)","v":0}]
[null,null,null,null,null,null,null,null,{"$f":"'8.ANALISIS TÉCNICO'!M77","v":0},null,null,null,null,null,null,null,null,null,null,null,null,null,{"$f":"U26*S26","v":0}]
[null,{"$f":"'8.ANALISIS TÉCNICO'!E113","v":"HECTÁREAS DE COBERTURA VEGETAL INCREMENTADAS DE LOS ECOSISTEMAS ASOCIADOS"},null,null,null,null,null,null,{"$f":"'8.ANALISIS TÉCNICO'!C78","v":"RECUPERACIÓN DE LA COBERTURA VEGETAL DE LOS ECOSISTEMAS ASOCIADOS"},null,null,null,null,null,null,{"$f":"IF(I27=\"\",\"\",\"Infraestructura natural\")","v":"Infraestructura natural"},null,{"$f":"IF(I27=\"\",\"\",\"HA\")","v":"HA"},null,null,null,null,{"$f":"W28+W34+W37+W41","v":0}]
[null,null,null,null,null,null,null,null,{"$f":"'8.ANALISIS TÉCNICO'!D78","v":"REFORESTACIÓN CON ESPECIES NATIVAS"},null,null,null,null,null,null,{"$f":"'8.ANALISIS TÉCNICO'!H78","v":"Infraestructura Natural"},null,{"$f":"IF(I28=\"\",\"\",\"HA\")","v":"HA"},null,null,null,null,{"$f":"SUM(W29:X33)","v":0}]
[null,null,null,null,null,null,null,null,{"$f":"IF(I28=\"\",\"\",datos!J191)","v":"PLANIFICACIÓN DE ESPECIES A ADQUIRIR O PRODUCIR"},null,null,null,null,null,null,null,null,{"$f":"IF(I29=\"\",\"\",datos!J203)","v":"UNIDAD"},null,null,null,null,{"$f":"U29*S29","v":0}]
[null,null,null,null,null,null,null,null,{"$f":"IF(I28=\"\",\"\",datos!J193)","v":"IMPLEMENTACIÓN DE VIVEROS FORESTALES"},null,null,null,null,null,null,null,null,{"$f":"IF(I30=\"\",\"\",datos!J204)","v":"M2"},null,null,null,null,{"$f":"U30*S30","v":0}]
[null,null,null,null,null,null,null,null,{"$f":"IF(I28=\"\",\"\",datos!J195)","v":"LABORES CULTURALES EN PRODUCCIÓN DE PLANTONES"},null,null,null,null,null,null,null,null,{"$f":"IF(I31=\"\",\"\",datos!J205)","v":"HORAS HOMBRE"},null,null,null,null,{"$f":"U31*S31","v":0}]
[null,null,null,null,null,null,null,null,{"$f":"IF(I28=\"\",\"\",datos!J197)","v":"PLANTACIÓN PROPIAMENTE DICHA"},null,null,null,null,null,null,null,null,{"$f":"IF(I32=\"\",\"\",datos!J206)","v":"HA"},null,null,null,null,{"$f":"U32*S32","v":0}]
[null,null,null,null,null,null,null,null,{"$f":"IF(I28=\"\",\"\",datos!J199)","v":"LABORES CULTURALES A PLANTONES INSTALADOS"},null,null,null,null,null,null,null,null,{"$f":"IF(I33=\"\",\"\",datos!J207)","v":"HORAS HOMBRE"},null,null,null,null,{"$f":"U33*S33","v":0}]
[null,null,null,null,null,null,null,null,{"$f":"'8.ANALISIS TÉCNICO'!D79","v":"REVEGETACIÓN CON ESPECIES NATIVAS"},null,null,null,null,null,null,{"$f":"'8.ANALISIS TÉCNICO'!H79","v":"Infraestructura Natural"},null,{"$f":"IF(I34=\"\",\"\",\"HA\")","v":"HA"},null,null,null,null,{"$f":"SUM(W35:X36)","v":0}]
[null,null,null,null,null,null,null,null,{"$f":"IF(I34=\"\",\"\",datos!K191)","v":"SIEMBRA DE ESPECIES HERBÁCEAS SELECCIONADAS"},null,null,null,null,null,null,null,null,{"$f":"IF(I35=\"\",\"\",datos!K203)","v":"HA"},null,null,null,null,{"$f":"U35*S35","v":0}]
[null,null,null,null,null,null,null,null,{"$f":"IF(I34=\"\",\"\",datos!K193)","v":"LABORES CULTURALES A ESPECIES HERBÁCEAS"},null,null,null,null,null,null,null,null,{"$f":"IF(I36=\"\",\"\",datos!K204)","v":"HORAS HOMBRE"},null,null,null,null,{"$f":"U36*S36","v":0}]
[null,null,null,null,null,null,null,null,{"$f":"'8.ANALISIS TÉCNICO'!D80","v":"INSTALACIÓN DE CERCOS EXCLUIDORES"},null,null,null,null,null,null,{"$f":"'8.ANALISIS TÉCNICO'!H80","v":"Infraestructura"},null,{"$f":"IF(I37=\"\",\"\",\"ML\")","v":"ML"},null,null,null,null,{"$f":"SUM(W38:X40)","v":0}]
[null,null,null,null,null,null,null,null,{"$f":"IF(I37=\"\",\"\",datos!L191)","v":"TRAZO Y MARCACIÓN"},null,null,null,null,null,null,null,null,{"$f":"IF(I38=\"\",\"\",datos!L203)","v":"ML"},null,null,null,null,{"$f":"U38*S38","v":0}]
[null,null,null,null,null,null,null,null,{"$f":"IF(I37=\"\",\"\",datos!L193)","v":"APERTURA DE HOYOS"},null,null,null,null,null,null,null,null,{"$f":"IF(I39=\"\",\"\",datos!L204)","v":"UNIDAD"},null,null,null,null,{"$f":"U39*S39","v":0}]
[null,null,null,null,null,null,null,null,{"$f":"IF(I37=\"\",\"\",datos!L195)","v":"TRASLADO DE PLANTADO DE POSTES"},null,null,null,null,null,null,null,null,{"$f":"IF(I40=\"\",\"\",datos!L205)","v":"ML"},null,null,null,null,{"$f":"U40*S40","v":0}]
[null,null,null,null,null,null,null,null,{"$f":"'8.ANALISIS TÉCNICO'!D81","v":"OTRO:"},null,null,null,null,null,null,{"$f":"'8.ANALISIS TÉCNICO'!H81","v":0},null,null,null,null,null,null,{"$f":"SUM(W42)","v":0}]
[null,null,null,null,null,null,null,null,{"$f":"'8.ANALISIS TÉCNICO'!M81","v":0},null,null,null,null,null,null,null,null,null,null,null,null,null,{"$f":"U42*S42","v":0}]
[null,{"$f":"'8.ANALISIS TÉCNICO'!E118","v":"HECTÁREAS DE LA ESTRUCTURA DEL SUELO RECUPERADA DE LOS ECOSISTEMAS ASOCIADOS"},null,null,null,null,null,null,{"$f":"'8.ANALISIS TÉCNICO'!C82","v":"RECUPERACIÓN DE LAS CARACTERÍSTICAS DEL SUELO DEL ECOSISTEMA ASOCIADO"},null,null,null,null,null,null,{"$f":"IF(I43=\"\",\"\",\"Infraestructura natural\")","v":"Infraestructura natural"},null,{"$f":"IF(I43=\"\",\"\",\"HA\")","v":"HA"},null,null,null,null,{"$f":"W44+W49","v":0}]
[null,null,null,null,null,null,null,null,{"$f":"'8.ANALISIS TÉCNICO'!D82","v":"ENRIQUECIMIENTO DE SUELOS"},null,null,null,null,null,null,{"$f":"'8.ANALISIS TÉCNICO'!H82","v":"Infraestructura Natural"},null,{"$f":"IF(I44=\"\",\"\",\"HA\")","v":"HA"},null,null,null,null,{"$f":"SUM(W45:X46)","v":0}]
[null,null,null,null,null,null,null,null,{"$f":"IF(I44=\"\",\"\",datos!F191)","v":"DESHIERBO"},null,null,null,null,null,null,null,null,{"$f":"IF(I45=\"\",\"\",datos!F203)","v":"M2"},null,null,null,null,{"$f":"U45*S45","v":0}]
[null,null,null,null,null,null,null,null,{"$f":"IF(I44=\"\",\"\",datos!F193)","v":"ABONAMIENTO POR FUENTES MINERALES"},null,null,null,null,null,null,null,null,{"$f":"IF(I46=\"\",\"\",datos!F204)","v":"M2"},null,null,null,null,{"$f":"U46*S46","v":0}]
[null,null,null,null,null,null,null,null,{"$f":"IF(I44=\"\",\"\",datos!F195)","v":"ABONAMIENTO ORGÁNICO DEL ÁREA"},null,null,null,null,null,null,"Infraestructura natural",null,{"$f":"IF(I47=\"\",\"\",datos!F205)","v":"M2"},null,null,null,null,{"$f":"U47*S47","v":0}]
[null,null,null,null,null,null,null,null,{"$f":"IF(I44=\"\",\"\",datos!F197)","v":"INSTALACIÓN DE VEGETACIÓN PARA ENRIQUECIMIENTO DEL SUELO"},null,null,null,null,null,null,"Infraestructura natural",null,{"$f":"IF(I48=\"\",\"\",datos!F206)","v":"HA"},null,null,null,null,{"$f":"U48*S48","v":0}]
[null,null,null,null,null,null,null,null,{"$f":"'8.ANALISIS TÉCNICO'!D83","v":"OTRO:"},null,null,null,null,null,null,{"$f":"'8.ANALISIS TÉCNICO'!H83","v":0},null,null,null,null,null,null,{"$f":"SUM(W50)","v":0}]
[null,null,null,null,null,null,null,null,{"$f":"'8.ANALISIS TÉCNICO'!M83","v":0},null,null,null,null,null,null,null,null,null,null,null,null,null,{"$f":"U50*S50","v":0}]
[null,{"$f":"'8.ANALISIS TÉCNICO'!E121","v":"NÚMERO DE MEDIDAS DE ADAPTACIÓN AL RÉGIMEN DE PRECIPITACIONES Y TEMPERATURAS"},null,null,null,null,null,null,{"$f":"'8.ANALISIS TÉCNICO'!C84","v":"ADAPTACIÓN A LOS REGÍMENES DE PRECIPITACIÓN Y TEMPERATURAS"},null,null,null,null,null,null,{"$f":"IF(I51=\"\",\"\",\"Infraestructura natural\")","v":"Infraestructura natural"},null,{"$f":"IF(I51=\"\",\"\",\"UNIDADES\")","v":"UNIDADES"},null,null,null,null,{"$f":"W52+W56+W60+W71+W66+W64","v":0}]
[null,null,null,null,null,null,null,null,{"$f":"'8.ANALISIS TÉCNICO'!D84","v":"REPARACIÓN DEL CANAL AMUNADOR"},null,null,null,null,null,null,{"$f":"'8.ANALISIS TÉCNICO'!H84","v":"Infraestructura Natural"},null,{"$f":"IF(I52=\"\",\"\",\"HA\")","v":"HA"},null,null,null,null,{"$f":"SUM(W53:X55)","v":0}]
[null,null,null,null,null,null,null,null,{"$f":"IF(I52=\"\",\"\",datos!P191)","v":"CONSTRUCCIÓN DE DIQUE Y ESTRUCTURA DE CAPTACIÓN"},null,null,null,null,null,null,null,null,{"$f":"IF(I53=\"\",\"\",datos!P203)","v":"UNIDAD"},null,null,null,null,{"$f":"U53*S53","v":0}]
[null,null,null,null,null,null,null,null,{"$f":"IF(I52=\"\",\"\",datos!P193)","v":"MEJORAMIENTO DEL CANAL AMUNADOR"},null,null,null,null,null,null,null,null,{"$f":"IF(I54=\"\",\"\",datos!P204)","v":"UNIDAD"},null,null,null,null,{"$f":"U54*S54","v":0}]
[null,null,null,null,null,null,null,null,{"$f":"IF(I52=\"\",\"\",datos!P195)","v":"INSTALACIÓN DE ÁREA DE PROTECCIÓN"},null,null,null,null,null,null,null,null,{"$f":"IF(I55=\"\",\"\",datos!P205)","v":"HA"},null,null,null,null,{"$f":"U55*S55","v":0}]
[null,null,null,null,null,null,null,null,{"$f":"'8.ANALISIS TÉCNICO'!D85","v":"REPARACIÓN DEL CANAL DE MAMANTEO"},null,null,null,null,null,null,{"$f":"'8.ANALISIS TÉCNICO'!H85","v":"Infraestructura Natural"},null,{"$f":"IF(I56=\"\",\"\",\"ML\")","v":"ML"},null,null,null,null,{"$f":"SUM(W57:X59)","v":0}]
[null,null,null,null,null,null,null,null,{"$f":"IF(I56=\"\",\"\",datos!Q191)","v":"DESCOLMATACIÓN DE CANALES"},null,null,null,null,null,null,null,null,{"$f":"IF(I57=\"\",\"\",datos!Q203)","v":"UNIDAD"},null,null,null,null,{"$f":"U57*S57","v":0}]
[null,null,null,null,null,null,null,null,{"$f":"IF(I56=\"\",\"\",datos!Q193)","v":"RECONSTRUCCIÓN E IMPLEMENTACIÓN DE CANALES DE MAMANTEO"},null,null,null,null,null,null,null,null,{"$f":"IF(I58=\"\",\"\",datos!Q204)","v":"UNIDAD"},null,null,null,null,{"$f":"U58*S58","v":0}]
[null,null,null,null,null,null,null,null,{"$f":"IF(I56=\"\",\"\",datos!Q195)","v":"INSTALACIÓN DE MEDIDAS DE PROTECCIÓN"},null,null,null,null,null,null,null,null,{"$f":"IF(I59=\"\",\"\",datos!Q205)","v":"HA"},null,null,null,null,{"$f":"U59*S59","v":0}]
[null,null,null,null,null,null,null,null,{"$f":"'8.ANALISIS TÉCNICO'!D86","v":"CONSTRUCCIÓN DE ZANJAS DE INFILTRACIÓN"},null,null,null,null,null,null,{"$f":"'8.ANALISIS TÉCNICO'!H86","v":"Infraestructura Natural"},null,{"$f":"IF(I60=\"\",\"\",\"ML\")","v":"ML"},null,null,null,null,{"$f":"SUM(W61:X63)","v":0}]
[null,null,null,null,null,null,null,null,{"$f":"IF(I60=\"\",\"\",datos!R191)","v":"TRAZO, NIVELES Y REPLANTE PRELIMINAR"},null,null,null,null,null,null,null,null,{"$f":"IF(I61=\"\",\"\",datos!R203)","v":"M2"},null,null,null,null,{"$f":"U61*S61","v":0}]
[null,null,null,null,null,null,null,null,{"$f":"IF(I60=\"\",\"\",datos!R193)","v":"EXCAVACIÓN DE ZANJAS DE INFILTRACIÓN"},null,null,null,null,null,null,null,null,{"$f":"IF(I62=\"\",\"\",datos!R204)","v":"ML"},null,null,null,null,{"$f":"U62*S62","v":0}]
[null,null,null,null,null,null,null,null,{"$f":"IF(I60=\"\",\"\",datos!R195)","v":"COMPACTACIÓN DEL TERRENO"},null,null,null,null,null,null,null,null,{"$f":"IF(I63=\"\",\"\",datos!R205)","v":"HA"},null,null,null,null,{"$f":"U63*S63","v":0}]
[null,null,null,null,null,null,null,null,{"$f":"'8.ANALISIS TÉCNICO'!D87","v":"INSTALACIÓN DE QOCHAS"},null,null,null,null,null,null,{"$f":"'8.ANALISIS TÉCNICO'!H87","v":"Infraestructura Natural"},null,"UNIDAD",null,null,null,null,{"$f":"SUM(W65)","v":0}]
[null,null,null,null,null,null,null,null,{"$f":"IF(I64=\"\",\"\",datos!S191)","v":"CONSTRUCCIÓN DE DIQUES"},null,null,null,null,null,null,null,null,{"$f":"IF(I65=\"\",\"\",datos!S203)","v":"UNIDAD"},null,null,null,null,{"$f":"U65*S65","v":0}]
[null,null,null,null,null,null,null,null,{"$f":"'8.ANALISIS TÉCNICO'!D88","v":"CONSTRUCCIÓN DE TERRAZAS DE FORMACIÓN DE SUELOS"},null,null,null,null,null,null,{"$f":"'8.ANALISIS TÉCNICO'!H88","v":"Infraestructura Natural"},null,{"$f":"IF(I66=\"\",\"\",\"HA\")","v":"HA"},null,null,null,null,0]
[null,null,null,null,null,null,null,null,{"$f":"IF(I66=\"\",\"\",datos!G191)","v":"TRAZO Y MARCACIÓN"},null,null,null,null,null,null,null,null,{"$f":"IF(I67=\"\",\"\",datos!O203)","v":"ML"},null,null,null,null,0]
[null,null,null,null,null,null,null,null,{"$f":"IF(I66=\"\",\"\",datos!G192)","v":"REMOCIÓN DE TIERRA FÉRTIL"},null,null,null,null,null,null,null,null,{"$f":"IF(I68=\"\",\"\",datos!O204)","v":"HA"},null,null,null,null,0]
[null,null,null,null,null,null,null,null,{"$f":"IF(I66=\"\",\"\",datos!G193)","v":"COMPACTACIÓN DEL SUELO DE LA TERRAZA"},null,null,null,null,null,null,null,null,{"$f":"IF(I69=\"\",\"\",datos!O205)","v":"HA"},null,null,null,null,0]
[null,null,null,null,null,null,null,null,{"$f":"IF(I66=\"\",\"\",datos!G194)","v":"EMPAREJAMIENTO DE LA TERRAZA"},null,null,null,null,null,null,null,null,{"$f":"IF(I70=\"\",\"\",datos!O206)","v":"HA"},null,null,null,null,0]
[null,null,null,null,null,null,null,null,{"$f":"'8.ANALISIS TÉCNICO'!D89","v":"OTRO:"},null,null,null,null,null,null,{"$f":"'8.ANALISIS TÉCNICO'!H89","v":0},null,null,null,null,null,null,{"$f":"SUM(W72)","v":0}]
[null,null,null,null,null,null,null,null,{"$f":"'8.ANALISIS TÉCNICO'!M89","v":0},null,null,null,null,null,null,null,null,null,null,null,null,null,{"$f":"U72*S72","v":0}]
[null,{"$f":"'8.ANALISIS TÉCNICO'!E128","v":"POBLADORES CON ADECUADAS CAPACIDADES EN PRÁCTICAS DE MANEJO DE LOS ECOSISTEMAS DE INTERÉS HÍDRICO"},null,null,null,null,null,null,{"$f":"'8.ANALISIS TÉCNICO'!C90","v":"ADECUADAS PRÁCTICAS DEL MANEJO DEL ECOSISTEMA"},null,null,null,null,null,null,{"$f":"IF(I73=\"\",\"\",\"Intangible\")","v":"Intangible"},null,{"$f":"IF(I73=\"\",\"\",\"POBLACIÓN\")","v":"POBLACIÓN"},null,null,null,null,{"$f":"W74+W77+W80+W84+W82+W86","v":0}]
[null,null,null,null,null,null,null,null,{"$f":"'8.ANALISIS TÉCNICO'!D90","v":"CAPACITACIÓN EN GESTIÓN INTEGRADA DE RECURSOS HÍDRICOS CON ENFOQUE DE CUENCA"},null,null,null,null,null,null,{"$f":"'8.ANALISIS TÉCNICO'!H90","v":"Intangible"},null,{"$f":"IF(I74=\"\",\"\",\"EVENTO\")","v":"EVENTO"},null,null,null,null,{"$f":"SUM(W75:X76)","v":0}]
[null,null,null,null,null,null,null,null,{"$f":"IF(I74=\"\",\"\",datos!T191)","v":"COORDINACIÓN CON ORGANIZACIONES Y COMITÉS DE LA COMUNIDAD EXISTENTE"},null,null,null,null,null,null,null,null,{"$f":"IF(I75=\"\",\"\",datos!T203)","v":"HORAS HOMBRE"},null,null,null,null,{"$f":"U75*S75","v":0}]
[null,null,null,null,null,null,null,null,{"$f":"IF(I74=\"\",\"\",datos!T193)","v":"TALLERES DE CAPACITACIÓN A ORGANIZACIONES Y COMITÉS DE LA COMUNIDAD EXISTENTE"},null,null,null,null,null,null,null,null,{"$f":"IF(I76=\"\",\"\",datos!T204)","v":"TALLER"},null,null,null,null,0]
[null,null,null,null,null,null,null,null,{"$f":"'8.ANALISIS TÉCNICO'!D91","v":"ASISTENCIA TÉCNICA EN EL MANEJO DE ECOSISTEMAS DE INTERÉS HÍDRICO"},null,null,null,null,null,null,{"$f":"'8.ANALISIS TÉCNICO'!H91","v":"Intangible"},null,{"$f":"IF(I77=\"\",\"\",\"EVENTO\")","v":"EVENTO"},null,null,null,null,{"$f":"SUM(W78:X79)","v":0}]
[null,null,null,null,null,null,null,null,{"$f":"IF(I77=\"\",\"\",datos!U191)","v":"COORDINACIÓN CON ORGANIZACIONES Y COMITÉS DE LA COMUNIDAD"},null,null,null,null,null,null,null,null,{"$f":"IF(I78=\"\",\"\",datos!U203)","v":"HORAS HOMBRE"},null,null,null,null,0]
[null,null,null,null,null,null,null,null,{"$f":"IF(I77=\"\",\"\",datos!U193)","v":"TALLERES DE CAPACITACIÓN A ORGANIZACIONES Y COMITÉS DE LA COMUNIDAD EXISTENTE"},null,null,null,null,null,null,null,null,{"$f":"IF(I79=\"\",\"\",datos!U204)","v":"TALLER"},null,null,null,null,0]
[null,null,null,null,null,null,null,null,{"$f":"'8.ANALISIS TÉCNICO'!D92","v":"CAPACITACIÓN EN BUENAS PRÁCTICAS PARA LA ADAPTACIÓN AL CAMBIO CLIMÁTICO Y GESTIÓN DE RIESGOS"},null,null,null,null,null,null,{"$f":"'8.ANALISIS TÉCNICO'!H92","v":"Intangible"},null,{"$f":"IF(I80=\"\",\"\",\"TALLER\")","v":"TALLER"},null,null,null,null,{"$f":"SUM(W81)","v":0}]
[null,null,null,null,null,null,null,null,{"$f":"IF(I80=\"\",\"\",datos!V191)","v":"TALLERES DE CAPACITACIÓN EN ADAPTACIÓN AL CAMBIO CLIMÁTICO"},null,null,null,null,null,null,null,null,{"$f":"IF(I81=\"\",\"\",datos!V203)","v":"TALLER"},null,null,null,null,0]
[null,null,null,null,null,null,null,null,{"$f":"'8.ANALISIS TÉCNICO'!D93","v":"SENSIBILIZACIÓN RELACIONADA A LA RECUPERACIÓN DEL SERVICIO ECOSISTÉMICO DE REGULACIÓN HÍDRICA"},null,null,null,null,null,null,{"$f":"'8.ANALISIS TÉCNICO'!H93","v":"Intangible"},null,{"$f":"IF(I82=\"\",\"\",\"TALLER\")","v":"TALLER"},null,null,null,null,{"$f":"SUM(W83)","v":0}]
[null,null,null,null,null,null,null,null,{"$f":"IF(I82=\"\",\"\",datos!W191)","v":"CAMPAÑAS DE SENSIBILIZACIÓN"},null,null,null,null,null,null,null,null,{"$f":"IF(I83=\"\",\"\",datos!W203)","v":"TALLER"},null,null,null,null,0]
[null,null,null,null,null,null,null,null,{"$f":"'8.ANALISIS TÉCNICO'!D94","v":"INTERCAMBIO DE EXPERIENCIAS RELACIONADA A LA RECUPERACIÓN DEL SERVICIO ECOSISTÉMICO DE REGULACIÓN HÍDRICA"},null,null,null,null,null,null,{"$f":"'8.ANALISIS TÉCNICO'!H94","v":"Intangible"},null,{"$f":"IF(I84=\"\",\"\",\"EVENTO\")","v":"EVENTO"},null,null,null,null,{"$f":"SUM(W85)","v":0}]
[null,null,null,null,null,null,null,null,{"$f":"IF(I84=\"\",\"\",datos!X191)","v":"REALIZACIÓN DE PASANTÍAS"},null,null,null,null,null,null,null,null,{"$f":"IF(I85=\"\",\"\",datos!X203)","v":"PASANTÍA"},null,null,null,null,0]
[null,null,null,null,null,null,null,null,{"$f":"'8.ANALISIS TÉCNICO'!D95","v":"OTRO:"},null,null,null,null,null,null,{"$f":"'8.ANALISIS TÉCNICO'!H95","v":0},null,null,null,null,null,null,{"$f":"SUM(W87)","v":0}]
[null,null,null,null,null,null,null,null,{"$f":"'8.ANALISIS TÉCNICO'!M95","v":0},null,null,null,null,null,null,null,null,null,null,null,null,null,{"$f":"U87*S87","v":0}]
[null,{"$f":"'8.ANALISIS TÉCNICO'!E135","v":"N° DE ÁREAS U ÓRGANOS ENCARGADOS DE LA GESTIÓN DEL ECOSISTEMA DE INTERÉS HÍDRICO CON ADECUADAS CAPACIDADES EN GESTIÓN DEL ECOSISTEMA"},null,null,null,null,null,null,{"$f":"'8.ANALISIS TÉCNICO'!C96","v":"ADECUADAS CAPACIDADES DE LAS ENTIDADES A CARGO DE LA GESTIÓN DEL ECOSISTEMA"},null,null,null,null,null,null,{"$f":"IF(I88=\"\",\"\",\"Intangible\")","v":"Intangible"},null,{"$f":"IF(I88=\"\",\"\",\"UNIDAD\")","v":"UNIDAD"},null,null,null,null,{"$f":"W89+W91+W93+W97+W95","v":0}]
[null,null,null,null,null,null,null,null,{"$f":"'8.ANALISIS TÉCNICO'!D96","v":"CAPACITACIÓN A FUNCIONARIOS PÚBLICOS SOBRE LA GESTIÓN INTEGRADA DEL RECURSO HÍDRICO CON ENFOQUE DE CUENCA"},null,null,null,null,null,null,{"$f":"'8.ANALISIS TÉCNICO'!H96","v":"Intangible"},null,{"$f":"IF(I89=\"\",\"\",\"TALLER\")","v":"TALLER"},null,null,null,null,{"$f":"SUM(W90)","v":0}]
[null,null,null,null,null,null,null,null,{"$f":"IF(I89=\"\",\"\",datos!Y191)","v":"TALLERES DE CAPACITACIÓN SOBRE GESTIÓN DEL ECOSISTEMA"},null,null,null,null,null,null,null,null,{"$f":"IF(I90=\"\",\"\",datos!Y203)","v":"TALLER"},null,null,null,null,{"$f":"U90*S90","v":0}]
[null,null,null,null,null,null,null,null,{"$f":"'8.ANALISIS TÉCNICO'!D97","v":"CAPACITACIÓN A FUNCIONARIOS PÚBLICOS SOBRE LAS MEDIDAS DE ADAPTACIÓN EN UN CONTEXTO DE CAMBIO CLIMÁTICO EN LA GESTIÓN INTEGRADA DE LOS RECURSOS HÍDRICOS"},null,null,null,null,null,null,{"$f":"'8.ANALISIS TÉCNICO'!H97","v":"Intangible"},null,{"$f":"IF(I91=\"\",\"\",\"TALLER\")","v":"TALLER"},null,null,null,null,{"$f":"SUM(W92)","v":0}]
[null,null,null,null,null,null,null,null,{"$f":"IF(I91=\"\",\"\",datos!Z191)","v":"TALLERES DE CAPACITACIÓN SOBRE CAMBIO CLIMÁTICO"},null,null,null,null,null,null,null,null,{"$f":"IF(I92=\"\",\"\",datos!Z203)","v":"TALLER"},null,null,null,null,0]
[null,null,null,null,null,null,null,null,{"$f":"'8.ANALISIS TÉCNICO'!D98","v":"DESARROLLO DE CAPACIDADES PARA EL MONITOREO Y SEGUIMIENTO DE LOS ECOSISTEMAS DE INTERÉS HÍDRICO Y EL SERVICIO ECOSISTÉMICO DE REGULACIÓN HÍDRICA"},null,null,null,null,null,null,{"$f":"'8.ANALISIS TÉCNICO'!H98","v":"Intangible"},null,{"$f":"IF(I93=\"\",\"\",\"TALLER\")","v":"TALLER"},null,null,null,null,{"$f":"SUM(W94)","v":0}]
[null,null,null,null,null,null,null,null,{"$f":"IF(I93=\"\",\"\",datos!AA191)","v":"TALLERES DE CAPACITACIÓN SOBRE MONITOREO Y SEGUIMIENTO"},null,null,null,null,null,null,null,null,{"$f":"IF(I94=\"\",\"\",datos!AA203)","v":"TALLER"},null,null,null,null,0]
[null,null,null,null,null,null,null,null,{"$f":"'8.ANALISIS TÉCNICO'!D99","v":"INTERCAMBIO DE EXPERIENCIAS SOBRE LA GESTIÓN INTEGRADA DEL RECURSO HÍDRICO CON ENFOQUE DE CUENCA"},null,null,null,null,null,null,{"$f":"'8.ANALISIS TÉCNICO'!H99","v":"Intangible"},null,{"$f":"IF(I95=\"\",\"\",\"EVENTO\")","v":"EVENTO"},null,null,null,null,{"$f":"SUM(W96)","v":0}]
[null,null,null,null,null,null,null,null,{"$f":"IF(I95=\"\",\"\",datos!AB191)","v":"REALIZACIÓN DE PASANTÍAS"},null,null,null,null,null,null,null,null,{"$f":"IF(I96=\"\",\"\",datos!AB203)","v":"PASANTÍA"},null,null,null,null,0]
[null,null,null,null,null,null,null,null,{"$f":"'8.ANALISIS TÉCNICO'!D100","v":"OTRO:"},null,null,null,null,null,null,{"$f":"'8.ANALISIS TÉCNICO'!H100","v":0},null,null,null,null,null,null,{"$f":"SUM(W98)","v":0}]
[null,null,null,null,null,null,null,null,{"$f":"'8.ANALISIS TÉCNICO'!M100","v":0},null,null,null,null,null,null,null,null,null,null,null,null,null,0]
[]
[null,"OTROS COSTOS",null,null,null,null,null,null,null,null,null,null,null,null,null,null,null,"UNIDAD DE PRODUCCIÓN",null,null,"COSTO UNITARIO EN SOLES",null,"COSTOS SUB TOTAL EN SOLES"]
[null,null,null,null,null,null,null,null,null,null,null,null,null,null,null,null,null,"UM","META"]
[]
[null,"GESTIÓN DEL PROYECTO",null,null,null,null,null,null,null,null,null,null,null,null,null,null,null,"GLOBAL",null,null,null,null,{"$f":"U103*S103","v":0}]
[null,"EXPEDIENTE TÉCNICO",null,null,null,null,null,null,null,null,null,null,null,null,null,null,null,"GLOBAL",null,null,null,null,{"$f":"U104*S104","v":0}]
[null,"SUPERVISIÓN DE EXPEDIENTE TÉCNICO",null,null,null,null,null,null,null,null,null,null,null,null,null,null,null,"GLOBAL",null,null,null,null,{"$f":"U105*S105","v":0}]
[null,"SUPERVISIÓN DE EJECUCIÓN FÍSICA DEL PROYECTO Y LIQUIDACIÓN",null,null,null,null,null,null,null,null,null,null,null,null,null,null,null,"GLOBAL",null,null,null,null,{"$f":"U106*S106","v":0}]
[null,"(*) Las acciones asociadas al factor de producción \"Infraestructura Natural\" corresponden a la naturaleza \"Adecuación\", mientras que las acciones asociadas al factor de producción \"Intangible\" corresponden a la naturaleza \"Implementación\". Estas consideraciones han sido desarrolladas en base a la Tabla 2.22 de la \"Guía General para la Identificación, Formulación y Evaluación de Proyectos de Inversión\" del Invierte.pe."]
[null,"RESUMEN"]
[null,"INDICADOR DE PRODUCTO",null,null,null,null,null,null,"DESCRIPCIÓN DE ACCIONES",null,null,null,null,null,null,"TIPO DE FACTOR PRODUCTIVO",null,"COSTOS SUB TOTAL EN SOLES"]
[]
[null,{"$f":"B11","v":"HECTÁREAS DE COBERTURA VEGETAL INCREMENTADAS DEL ECOSISTEMA PRINCIPAL"},null,null,null,null,null,null,{"$f":"I11","v":"RECUPERACIÓN DE LA COBERTURA VEGETAL NATIVA DEL ECOSISTEMA PRINCIPAL"},null,null,null,null,null,null,{"$f":"P11","v":"Infraestructura natural"},null,{"$f":"W11","v":0}]
[null,{"$f":"B21","v":"HECTÁREAS DE LA ESTRUCTURA DE LA TURBA RECUPERADA DEL ECOSISTEMA PRINCIPAL"},null,null,null,null,null,null,{"$f":"I21","v":"RECUPERACIÓN DE LAS CARACTERÍSTICAS DE LA TURBA DEL ECOSISTEMA PRINCIPAL"},null,null,null,null,null,null,{"$f":"P21","v":"Infraestructura natural"},null,{"$f":"W21","v":0}]
[null,{"$f":"B27","v":"HECTÁREAS DE COBERTURA VEGETAL INCREMENTADAS DE LOS ECOSISTEMAS ASOCIADOS"},null,null,null,null,null,null,{"$f":"I27","v":"RECUPERACIÓN DE LA COBERTURA VEGETAL DE LOS ECOSISTEMAS ASOCIADOS"},null,null,null,null,null,null,{"$f":"P27","v":"Infraestructura natural"},null,{"$f":"W27","v":0}]
[null,{"$f":"B43","v":"HECTÁREAS DE LA ESTRUCTURA DEL SUELO RECUPERADA DE LOS ECOSISTEMAS ASOCIADOS"},null,null,null,null,null,null,{"$f":"I43","v":"RECUPERACIÓN DE LAS CARACTERÍSTICAS DEL SUELO DEL ECOSISTEMA ASOCIADO"},null,null,null,null,null,null,{"$f":"P43","v":"Infraestructura natural"},null,{"$f":"W43","v":0}]
[null,{"$f":"B51","v":"NÚMERO DE MEDIDAS DE ADAPTACIÓN AL RÉGIMEN DE PRECIPITACIONES Y TEMPERATURAS"},null,null,null,null,null,null,{"$f":"I51","v":"ADAPTACIÓN A LOS REGÍMENES DE PRECIPITACIÓN Y TEMPERATURAS"},null,null,null,null,null,null,{"$f":"P51","v":"Infraestructura natural"},null,{"$f":"W51","v":0}]
[null,{"$f":"B73","v":"POBLADORES CON ADECUADAS CAPACIDADES EN PRÁCTICAS DE MANEJO DE LOS ECOSISTEMAS DE INTERÉS HÍDRICO"},null,null,null,null,null,null,{"$f":"I73","v":"ADECUADAS PRÁCTICAS DEL MANEJO DEL ECOSISTEMA"},null,null,null,null,null,null,{"$f":"P73","v":"Intangible"},null,{"$f":"W73","v":0}]
[null,{"$f":"B88","v":"N° DE ÁREAS U ÓRGANOS ENCARGADOS DE LA GESTIÓN DEL ECOSISTEMA DE INTERÉS HÍDRICO CON ADECUADAS CAPACIDADES EN GESTIÓN DEL ECOSISTEMA"},null,null,null,null,null,null,{"$f":"I88","v":"ADECUADAS CAPACIDADES DE LAS ENTIDADES A CARGO DE LA GESTIÓN DEL ECOSISTEMA"},null,null,null,null,null,null,{"$f":"P88","v":"Intangible"},null,{"$f":"W88","v":0}]
[null,"OTROS COSTOS",null,null,null,null,null,null,null,null,null,null,null,null,null,null,null,"COSTOS SUB TOTAL EN SOLES"]
[]
[]
[null,{"$f":"B103","v":"GESTIÓN DEL PROYECTO"},null,null,null,null,null,null,null,null,null,null,null,null,null,null,null,{"$f":"W103","v":0}]
[null,"EXPEDIENTE TÉCNICO",null,null,null,null,null,null,null,null,null,null,null,null,null,null,null,{"$f":"W104","v":0}]
[null,{"$f":"B105","v":"SUPERVISIÓN DE EXPEDIENTE TÉCNICO"},null,null,null,null,null,null,null,null,null,null,null,null,null,null,null,{"$f":"W105","v":0}]
[null,{"$f":"B106","v":"SUPERVISIÓN DE EJECUCIÓN FÍSICA DEL PROYECTO Y LIQUIDACIÓN"},null,null,null,null,null,null,null,null,null,null,null,null,null,null,null,{"$f":"W106","v":0}]
[]
[]
[null,"FACTORES DE CORRECCIÓN"]
[null,"MANO DE OBRA NO CALIFICADA","UBANO","RURAL"]
[null,"LIMA METROPOLITANA",0.86,"-",null,"MANO DE OBRA CALIFICADA",0.92592592592592582]
[null,"RESTO COSTA",0.68,0.56999999999999995,null,"BIENES NACIONALES",0.84745762711864414]
[null,"SIERRA",0.6,0.41,null,"BIENES IMPORTADOS",0.81719128329297819]
[null,"SELVA",0.63,0.49,null,"SERVICIOS",0.84745762711864414]
[null,"Fuente: Anexo 11 Parámetros de Evaluación Social de la Directiva N° 001-2019-EF/63.01."]
[]
[null,"COSTOS A PRECIOS SOCIALES"]
[null,"INDICADOR DE PRODUCTO",null,null,null,null,null,null,"DESCRIPCIÓN DE ACCIONES",null,null,null,null,null,null,"TIPO DE ITEM",null,"UNIDAD DE PRODUCCIÓN",null,null,"COSTO UNITARIO EN SOLES",null,"COSTOS SUB TOTAL EN SOLES"]
[null,null,null,null,null,null,null,null,null,null,null,null,null,null,null,null,null,"UM","META"]
[null,{"$f":"B11","v":"HECTÁREAS DE COBERTURA VEGETAL INCREMENTADAS DEL ECOSISTEMA PRINCIPAL"},null,null,null,null,null,null,{"$f":"I11","v":"RECUPERACIÓN DE LA COBERTURA VEGETAL NATIVA DEL ECOSISTEMA PRINCIPAL"},null,null,null,null,null,null,{"$f":"P11","v":"Infraestructura natural"},null,{"$f":"R11","v":"HA"},0,null,null,null,{"$f":"W139+W142+W146","v":0}]
[null,null,null,null,null,null,null,null,"REVEGETACIÓN CON ESPECIES NATIVAS",null,null,null,null,null,null,{"$f":"P12","v":"Infraestructura Natural"},null,"HA",0,null,null,null,{"$f":"SUM(W140:X141)","v":0}]
[null,null,null,null,null,null,null,null,"SIEMBRA DE ESPECIES HERBÁCEAS SELECCIONADAS",null,null,null,null,null,null,null,null,"HA",0,null,null,null,{"$f":"U140*S140","v":0}]
[null,null,null,null,null,null,null,null,"LABORES CULTURALES A ESPECIES HERBÁCEAS",null,null,null,null,null,null,null,null,"HORAS HOMBRE",0,null,null,null,{"$f":"U141*S141","v":0}]
[null,null,null,null,null,null,null,null,"INSTALACIÓN DE CERCOS EXCLUIDORES",null,null,null,null,null,null,{"$f":"P15","v":"Infraestructura"},null,"ML",0,null,null,null,{"$f":"SUM(W143:X145)","v":0}]
[null,null,null,null,null,null,null,null,"TRAZO Y MARCACIÓN",null,null,null,null,null,null,null,null,"ML",0,null,null,null,{"$f":"U143*S143","v":0}]
[null,null,null,null,null,null,null,null,"APERTURA DE HOYOS",null,null,null,null,null,null,null,null,"UNIDAD",0,null,null,null,{"$f":"U144*S144","v":0}]
[null,null,null,null,null,null,null,null,"TRASLADO DE PLANTADO DE POSTES",null,null,null,null,null,null,null,null,"ML",0,null,null,null,{"$f":"U145*S145","v":0}]
[null,null,null,null,null,null,null,null,"OTRO:",null,null,null,null,null,null,{"$f":"P19","v":0},null,0,0,null,null,null,{"$f":"SUM(W147)","v":0}]
[null,null,null,null,null,null,null,null,0,null,null,null,null,null,null,null,null,0,0,null,null,null,{"$f":"U147*S147","v":0}]
[null,{"$f":"B21","v":"HECTÁREAS DE LA ESTRUCTURA DE LA TURBA RECUPERADA DEL ECOSISTEMA PRINCIPAL"},null,null,null,null,null,null,"RECUPERACIÓN DE LAS CARACTERÍSTICAS DE LA TURBA DEL ECOSISTEMA PRINCIPAL",null,null,null,null,null,null,{"$f":"P21","v":"Infraestructura natural"},null,"HA",0,null,null,null,{"$f":"W149+W152","v":0}]
[null,null,null,null,null,null,null,null,"REVEGETACIÓN CON ESPECIES NATIVAS",null,null,null,null,null,null,{"$f":"P22","v":"Infraestructura Natural"},null,"HA",0,null,null,null,{"$f":"SUM(W150:X151)","v":0}]
[null,null,null,null,null,null,null,null,"SIEMBRA DE ESPECIES HERBÁCEAS SELECCIONADAS",null,null,null,null,null,null,null,null,"HA",0,null,null,null,{"$f":"U150*S150","v":0}]
[null,null,null,null,null,null,null,null,"LABORES CULTURALES A ESPECIES HERBÁCEAS",null,null,null,null,null,null,null,null,"HORAS HOMBRE",0,null,null,null,{"$f":"U151*S151","v":0}]
[null,null,null,null,null,null,null,null,"OTRO:",null,null,null,null,null,null,{"$f":"P25","v":0},null,0,0,null,null,null,{"$f":"SUM(W153)","v":0}]
[null,null,null,null,null,null,null,null,0,null,null,null,null,null,null,null,null,0,0,null,null,null,{"$f":"U153*S153","v":0}]
[null,{"$f":"B27","v":"HECTÁREAS DE COBERTURA VEGETAL INCREMENTADAS DE LOS ECOSISTEMAS ASOCIADOS"},null,null,null,null,null,null,"RECUPERACIÓN DE LA COBERTURA VEGETAL DE LOS ECOSISTEMAS ASOCIADOS",null,null,null,null,null,null,{"$f":"P27","v":"Infraestructura natural"},null,"HA",0,null,null,null,{"$f":"W155+W161+W164+W168","v":0}]
[null,null,null,null,null,null,null,null,"REFORESTACIÓN CON ESPECIES NATIVAS",null,null,null,null,null,null,{"$f":"P28","v":"Infraestructura Natural"},null,"HA",0,null,null,null,{"$f":"SUM(W156:X160)","v":0}]
[null,null,null,null,null,null,null,null,"PLANIFICACIÓN DE ESPECIES A ADQUIRIR O PRODUCIR",null,null,null,null,null,null,null,null,"UNIDAD",0,null,null,null,{"$f":"U156*S156","v":0}]
[null,null,null,null,null,null,null,null,"IMPLEMENTACIÓN DE VIVEROS FORESTALES",null,null,null,null,null,null,null,null,"M2",0,null,null,null,{"$f":"U157*S157","v":0}]
[null,null,null,null,null,null,null,null,"LABORES CULTURALES EN PRODUCCIÓN DE PLANTONES",null,null,null,null,null,null,null,null,{"$f":"R31","v":"HORAS HOMBRE"},0,null,null,null,{"$f":"U158*S158","v":0}]
[null,null,null,null,null,null,null,null,"PLANTACIÓN PROPIAMENTE DICHA",null,null,null,null,null,null,null,null,"HA",0,null,null,null,{"$f":"U159*S159","v":0}]
[null,null,null,null,null,null,null,null,"LABORES CULTURALES A PLANTONES INSTALADOS",null,null,null,null,null,null,null,null,"HORAS HOMBRE",0,null,null,null,{"$f":"U160*S160","v":0}]
[null,null,null,null,null,null,null,null,"REVEGETACIÓN CON ESPECIES NATIVAS",null,null,null,null,null,null,{"$f":"P34","v":"Infraestructura Natural"},null,"HA",0,null,null,null,{"$f":"SUM(W162:X163)","v":0}]
[null,null,null,null,null,null,null,null,"SIEMBRA DE ESPECIES HERBÁCEAS SELECCIONADAS",null,null,null,null,null,null,null,null,"HA",0,null,null,null,{"$f":"U162*S162","v":0}]
[null,null,null,null,null,null,null,null,"LABORES CULTURALES A ESPECIES HERBÁCEAS",null,null,null,null,null,null,null,null,"HORAS HOMBRE",0,null,null,null,{"$f":"U163*S163","v":0}]
[null,null,null,null,null,null,null,null,"INSTALACIÓN DE CERCOS EXCLUIDORES",null,null,null,null,null,null,{"$f":"P37","v":"Infraestructura"},null,"ML",0,null,null,null,{"$f":"SUM(W165:X167)","v":0}]
[null,null,null,null,null,null,null,null,"TRAZO Y MARCACIÓN",null,null,null,null,null,null,null,null,"ML",0,null,null,null,{"$f":"U165*S165","v":0}]
[null,null,null,null,null,null,null,null,"APERTURA DE HOYOS",null,null,null,null,null,null,null,null,"UNIDAD",0,null,null,null,{"$f":"U166*S166","v":0}]
[null,null,null,null,null,null,null,null,"TRASLADO DE PLANTADO DE POSTES",null,null,null,null,null,null,null,null,"ML",0,null,null,null,{"$f":"U167*S167","v":0}]
[null,null,null,null,null,null,null,null,"OTRO:",null,null,null,null,null,null,{"$f":"P41","v":0},null,0,0,null,null,null,{"$f":"SUM(W169)","v":0}]
[null,null,null,null,null,null,null,null,0,null,null,null,null,null,null,null,null,0,0,null,null,null,{"$f":"S169*U169","v":0}]
[null,{"$f":"B43","v":"HECTÁREAS DE LA ESTRUCTURA DEL SUELO RECUPERADA DE LOS ECOSISTEMAS ASOCIADOS"},null,null,null,null,null,null,"RECUPERACIÓN DE LAS CARACTERÍSTICAS DEL SUELO DEL ECOSISTEMA ASOCIADO",null,null,null,null,null,null,{"$f":"P43","v":"Infraestructura natural"},null,"HA",0,null,null,null,{"$f":"W171+W174","v":0}]
[null,null,null,null,null,null,null,null,"ENRIQUECIMIENTO DE SUELOS",null,null,null,null,null,null,{"$f":"P44","v":"Infraestructura Natural"},null,"HA",0,null,null,null,{"$f":"SUM(W172:X173)","v":0}]
[null,null,null,null,null,null,null,null,"DESHIERBO",null,null,null,null,null,null,null,null,"M2",0,null,null,null,{"$f":"U172*S172","v":0}]
[null,null,null,null,null,null,null,null,"ABONAMIENTO POR FUENTES MINERALES",null,null,null,null,null,null,null,null,"M2",0,null,null,null,{"$f":"U173*S173","v":0}]
[null,null,null,null,null,null,null,null,{"$f":"I49","v":"OTRO:"},null,null,null,null,null,null,{"$f":"P49","v":0},null,{"$f":"R49","v":0},0,null,null,null,{"$f":"SUM(W175)","v":0}]
[null,null,null,null,null,null,null,null,0,null,null,null,null,null,null,null,null,0,0,null,null,null,{"$f":"U175*S175","v":0}]
[null,{"$f":"B51","v":"NÚMERO DE MEDIDAS DE ADAPTACIÓN AL RÉGIMEN DE PRECIPITACIONES Y TEMPERATURAS"},null,null,null,null,null,null,"ADAPTACIÓN A LOS REGÍMENES DE PRECIPITACIÓN Y TEMPERATURAS",null,null,null,null,null,null,{"$f":"P51","v":"Infraestructura natural"},null,"UNIDADES",0,null,null,null,{"$f":"W177+W181+W185+W196+W191+W189","v":0}]
[null,null,null,null,null,null,null,null,"REPARACIÓN DEL CANAL AMUNADOR",null,null,null,null,null,null,{"$f":"P52","v":"Infraestructura Natural"},null,"HA",0,null,null,null,{"$f":"SUM(W178:X180)","v":0}]
[null,null,null,null,null,null,null,null,"CONSTRUCCIÓN DE DIQUE Y ESTRUCTURA DE CAPTACIÓN",null,null,null,null,null,null,null,null,"UNIDAD",0,null,null,null,{"$f":"U178*S178","v":0}]
[null,null,null,null,null,null,null,null,"MEJORAMIENTO DEL CANAL AMUNADOR",null,null,null,null,null,null,null,null,"UNIDAD",0,null,null,null,{"$f":"U179*S179","v":0}]
[null,null,null,null,null,null,null,null,{"$f":"I55","v":"INSTALACIÓN DE ÁREA DE PROTECCIÓN"},null,null,null,null,null,null,null,null,"HA",0,null,null,null,{"$f":"U180*S180","v":0}]
[null,null,null,null,null,null,null,null,"REPARACIÓN DEL CANAL DE MAMANTEO",null,null,null,null,null,null,{"$f":"P56","v":"Infraestructura Natural"},null,"ML",0,null,null,null,{"$f":"SUM(W182:X184)","v":0}]
[null,null,null,null,null,null,null,null,"DESCOLMATACIÓN DE CANALES",null,null,null,null,null,null,null,null,"UNIDAD",0,null,null,null,{"$f":"U182*S182","v":0}]
[null,null,null,null,null,null,null,null,"RECONSTRUCCIÓN E IMPLEMENTACIÓN DE CANALES DE MAMANTEO",null,null,null,null,null,null,null,null,"UNIDAD",0,null,null,null,{"$f":"U183*S183","v":0}]
[null,null,null,null,null,null,null,null,"INSTALACIÓN DE MEDIDAS DE PROTECCIÓN",null,null,null,null,null,null,null,null,"HA",0,null,null,null,{"$f":"U184*S184","v":0}]
[null,null,null,null,null,null,null,null,"CONSTRUCCIÓN DE ZANJAS DE INFILTRACIÓN",null,null,null,null,null,null,{"$f":"P60","v":"Infraestructura Natural"},null,"ML",0,null,null,null,{"$f":"SUM(W186:X188)","v":0}]
[null,null,null,null,null,null,null,null,"TRAZO, NIVELES Y REPLANTE PRELIMINAR",null,null,null,null,null,null,null,null,"M2",0,null,null,null,{"$f":"U186*S186","v":0}]
[null,null,null,null,null,null,null,null,"EXCAVACIÓN DE ZANJAS DE INFILTRACIÓN",null,null,null,null,null,null,null,null,"ML",0,null,null,null,{"$f":"U187*S187","v":0}]
[null,null,null,null,null,null,null,null,"COMPACTACIÓN DEL TERRENO",null,null,null,null,null,null,null,null,"HA",0,null,null,null,{"$f":"U188*S188","v":0}]
[null,null,null,null,null,null,null,null,"INSTALACIÓN DE QOCHAS",null,null,null,null,null,null,{"$f":"P64","v":"Infraestructura Natural"},null,"UNIDAD",0,null,null,null,{"$f":"SUM(W190)","v":0}]
[null,null,null,null,null,null,null,null,"CONSTRUCCIÓN DE DIQUES",null,null,null,null,null,null,null,null,"UNIDAD",0,null,null,null,{"$f":"U190*S190","v":0}]
[null,null,null,null,null,null,null,null,"CONSTRUCCIÓN DE TERRAZAS DE FORMACIÓN DE SUELOS",null,null,null,null,null,null,{"$f":"P66","v":"Infraestructura Natural"},null,{"$f":"+R66","v":"HA"},{"$f":"S66","v":0},null,null,null,0]
[null,null,null,null,null,null,null,null,"TRAZO Y MARCACIÓN",null,null,null,null,null,null,null,null,{"$f":"+R67","v":"ML"},0,null,null,null,0]
[null,null,null,null,null,null,null,null,"REMOCIÓN DE TIERRA FÉRTIL",null,null,null,null,null,null,null,null,"HA",0,null,null,null,0]
[null,null,null,null,null,null,null,null,"COMPACTACIÓN DEL SUELO DE LA TERRAZA",null,null,null,null,null,null,null,null,"HA",0,null,null,null,0]
[null,null,null,null,null,null,null,null,"EMPAREJAMIENTO DE LA TERRAZA",null,null,null,null,null,null,null,null,"HA",0,null,null,null,0]
[null,null,null,null,null,null,null,null,"OTRO:",null,null,null,null,null,null,{"$f":"P71","v":0},null,0,0,null,null,null,{"$f":"SUM(W197)","v":0}]
[null,null,null,null,null,null,null,null,0,null,null,null,null,null,null,null,null,0,0,null,null,null,{"$f":"U197*S197","v":0}]
[null,{"$f":"B73","v":"POBLADORES CON ADECUADAS CAPACIDADES EN PRÁCTICAS DE MANEJO DE LOS ECOSISTEMAS DE INTERÉS HÍDRICO"},null,null,null,null,null,null,"ADECUADAS PRÁCTICAS DEL MANEJO DEL ECOSISTEMA",null,null,null,null,null,null,{"$f":"P73","v":"Intangible"},null,{"$f":"R73","v":"POBLACIÓN"},0,null,null,null,{"$f":"W199+W202+W205+W209+W207+W211","v":0}]
[null,null,null,null,null,null,null,null,"CAPACITACIÓN EN GESTIÓN INTEGRADA DE RECURSOS HÍDRICOS CON ENFOQUE DE CUENCA",null,null,null,null,null,null,{"$f":"P74","v":"Intangible"},null,"EVENTO",0,null,null,null,{"$f":"SUM(W200:X201)","v":0}]
[null,null,null,null,null,null,null,null,"COORDINACIÓN CON ORGANIZACIONES Y COMITÉS DE LA COMUNIDAD EXISTENTE",null,null,null,null,null,null,null,null,"HORAS HOMBRE",0,null,null,null,{"$f":"U200*S200","v":0}]
[null,null,null,null,null,null,null,null,"TALLERES DE CAPACITACIÓN A ORGANIZACIONES Y COMITÉS DE LA COMUNIDAD EXISTENTE",null,null,null,null,null,null,null,null,"TALLER",0,null,null,null,{"$f":"U201*S201","v":0}]
[null,null,null,null,null,null,null,null,"ASISTENCIA TÉCNICA EN EL MANEJO DE ECOSISTEMAS DE INTERÉS HÍDRICO",null,null,null,null,null,null,{"$f":"P77","v":"Intangible"},null,"EVENTO",0,null,null,null,{"$f":"SUM(W203:X204)","v":0}]
[null,null,null,null,null,null,null,null,"COORDINACIÓN CON ORGANIZACIONES Y COMITÉS DE LA COMUNIDAD",null,null,null,null,null,null,null,null,"HORAS HOMBRE",0,null,null,null,{"$f":"U203*S203","v":0}]
[null,null,null,null,null,null,null,null,"TALLERES DE CAPACITACIÓN A ORGANIZACIONES Y COMITÉS DE LA COMUNIDAD EXISTENTE",null,null,null,null,null,null,null,null,"TALLER",0,null,null,null,{"$f":"U204*S204","v":0}]
[null,null,null,null,null,null,null,null,"CAPACITACIÓN EN BUENAS PRÁCTICAS PARA LA ADAPTACIÓN AL CAMBIO CLIMÁTICO Y GESTIÓN DE RIESGOS",null,null,null,null,null,null,{"$f":"P80","v":"Intangible"},null,"TALLER",0,null,null,null,{"$f":"SUM(W206)","v":0}]
[null,null,null,null,null,null,null,null,{"$f":"I81","v":"TALLERES DE CAPACITACIÓN EN ADAPTACIÓN AL CAMBIO CLIMÁTICO"},null,null,null,null,null,null,null,null,"TALLER",0,null,null,null,{"$f":"U206*S206","v":0}]
[null,null,null,null,null,null,null,null,"SENSIBILIZACIÓN RELACIONADA A LA RECUPERACIÓN DEL SERVICIO ECOSISTÉMICO DE REGULACIÓN HÍDRICA",null,null,null,null,null,null,{"$f":"P82","v":"Intangible"},null,"TALLER",0,null,null,null,{"$f":"SUM(W208)","v":0}]
[null,null,null,null,null,null,null,null,"CAMPAÑAS DE SENSIBILIZACIÓN",null,null,null,null,null,null,null,null,"TALLER",0,null,null,null,{"$f":"U208*S208","v":0}]
[null,null,null,null,null,null,null,null,"INTERCAMBIO DE EXPERIENCIAS RELACIONADA A LA RECUPERACIÓN DEL SERVICIO ECOSISTÉMICO DE REGULACIÓN HÍDRICA",null,null,null,null,null,null,{"$f":"P84","v":"Intangible"},null,"EVENTO",0,null,null,null,{"$f":"SUM(W210)","v":0}]
[null,null,null,null,null,null,null,null,"REALIZACIÓN DE PASANTÍAS",null,null,null,null,null,null,null,null,"PASANTÍA",0,null,null,null,{"$f":"U210*S210","v":0}]
[null,null,null,null,null,null,null,null,"OTRO:",null,null,null,null,null,null,{"$f":"P86","v":0},null,0,0,null,null,null,{"$f":"SUM(W212)","v":0}]
[null,null,null,null,null,null,null,null,0,null,null,null,null,null,null,null,null,0,0,null,null,null,{"$f":"U212*S212","v":0}]
[null,{"$f":"B88","v":"N° DE ÁREAS U ÓRGANOS ENCARGADOS DE LA GESTIÓN DEL ECOSISTEMA DE INTERÉS HÍDRICO CON ADECUADAS CAPACIDADES EN GESTIÓN DEL ECOSISTEMA"},null,null,null,null,null,null,"ADECUADAS CAPACIDADES DE LAS ENTIDADES A CARGO DE LA GESTIÓN DEL ECOSISTEMA",null,null,null,null,null,null,{"$f":"P88","v":"Intangible"},null,"UNIDAD",0,null,null,null,{"$f":"W214+W216+W218+W222+W220","v":0}]
[null,null,null,null,null,null,null,null,"CAPACITACIÓN A FUNCIONARIOS PÚBLICOS SOBRE LA GESTIÓN INTEGRADA DEL RECURSO HÍDRICO CON ENFOQUE DE CUENCA",null,null,null,null,null,null,{"$f":"P89","v":"Intangible"},null,"TALLER",0,null,null,null,{"$f":"SUM(W215)","v":0}]
[null,null,null,null,null,null,null,null,"TALLERES DE CAPACITACIÓN SOBRE GESTIÓN DEL ECOSISTEMA",null,null,null,null,null,null,null,null,"TALLER",0,null,null,null,{"$f":"U215*S215","v":0}]
[null,null,null,null,null,null,null,null,"CAPACITACIÓN A FUNCIONARIOS PÚBLICOS SOBRE LAS MEDIDAS DE ADAPTACIÓN EN UN CONTEXTO DE CAMBIO CLIMÁTICO EN LA GESTIÓN INTEGRADA DE LOS RECURSOS HÍDRICOS",null,null,null,null,null,null,{"$f":"P91","v":"Intangible"},null,"TALLER",0,null,null,null,{"$f":"SUM(W217)","v":0}]
[null,null,null,null,null,null,null,null,"TALLERES DE CAPACITACIÓN SOBRE CAMBIO CLIMÁTICO",null,null,null,null,null,null,null,null,"TALLER",0,null,null,null,{"$f":"U217*S217","v":0}]
[null,null,null,null,null,null,null,null,"DESARROLLO DE CAPACIDADES PARA EL MONITOREO Y SEGUIMIENTO DE LOS ECOSISTEMAS DE INTERÉS HÍDRICO Y EL SERVICIO ECOSISTÉMICO DE REGULACIÓN HÍDRICA",null,null,null,null,null,null,{"$f":"P93","v":"Intangible"},null,"TALLER",0,null,null,null,{"$f":"SUM(W219)","v":0}]
[null,null,null,null,null,null,null,null,"TALLERES DE CAPACITACIÓN SOBRE MONITOREO Y SEGUIMIENTO",null,null,null,null,null,null,null,null,"TALLER",0,null,null,null,{"$f":"U219*S219","v":0}]
[null,null,null,null,null,null,null,null,"INTERCAMBIO DE EXPERIENCIAS SOBRE LA GESTIÓN INTEGRADA DEL RECURSO HÍDRICO CON ENFOQUE DE CUENCA",null,null,null,null,null,null,{"$f":"P95","v":"Intangible"},null,"EVENTO",0,null,null,null,{"$f":"SUM(W221)","v":0}]
[null,null,null,null,null,null,null,null,"REALIZACIÓN DE PASANTÍAS",null,null,null,null,null,null,null,null,"PASANTÍA",0,null,null,null,{"$f":"U221*S221","v":0}]
[null,null,null,null,null,null,null,null,"OTRO:",null,null,null,null,null,null,{"$f":"P97","v":0},null,0,0,null,null,null,{"$f":"SUM(W223)","v":0}]
[null,null,null,null,null,null,null,null,0,null,null,null,null,null,null,null,null,0,0,null,null,null,{"$f":"U223*S223","v":0}]
[null,"OTROS COSTOS",null,null,null,null,null,null,null,null,null,null,null,null,null,null,null,"UNIDAD DE PRODUCCIÓN",null,null,"COSTO UNITARIO EN SOLES",null,"COSTOS SUB TOTAL EN SOLES"]
[null,null,null,null,null,null,null,null,null,null,null,null,null,null,null,null,null,"UM","META"]
[]
[null,"GESTIÓN DEL PROYECTO",null,null,null,null,null,null,null,null,null,null,null,null,null,null,null,"GLOBAL",1,null,null,null,0]
[null,"EXPEDIENTE TÉCNICO",null,null,null,null,null,null,null,null,null,null,null,null,null,null,null,"GLOBAL",1,null,null,null,0]
[null,"SUPERVISIÓN DE EXPEDIENTE TÉCNICO",null,null,null,null,null,null,null,null,null,null,null,null,null,null,null,"GLOBAL",1,null,null,null,0]
[null,"SUPERVISIÓN DE EJECUCIÓN FÍSICA DEL PROYECTO Y LIQUIDACIÓN",null,null,null,null,null,null,null,null,null,null,null,null,null,null,null,"GLOBAL",1,null,null,null,0]
[]
[null,"RESUMEN"]
[null,"INDICADOR DE PRODUCTO",null,null,null,null,null,null,"DESCRIPCIÓN DE ACCIONES",null,null,null,null,null,null,"TIPO DE ITEM",null,"COSTOS SUB TOTAL EN SOLES"]
[]
[null,{"$f":"B138","v":"HECTÁREAS DE COBERTURA VEGETAL INCREMENTADAS DEL ECOSISTEMA PRINCIPAL"},null,null,null,null,null,null,{"$f":"I138","v":"RECUPERACIÓN DE LA COBERTURA VEGETAL NATIVA DEL ECOSISTEMA PRINCIPAL"},null,null,null,null,null,null,{"$f":"P138","v":"Infraestructura natural"},null,{"$f":"W138","v":0}]
[null,{"$f":"B148","v":"HECTÁREAS DE LA ESTRUCTURA DE LA TURBA RECUPERADA DEL ECOSISTEMA PRINCIPAL"},null,null,null,null,null,null,{"$f":"I148","v":"RECUPERACIÓN DE LAS CARACTERÍSTICAS DE LA TURBA DEL ECOSISTEMA PRINCIPAL"},null,null,null,null,null,null,{"$f":"P148","v":"Infraestructura natural"},null,{"$f":"W148","v":0}]
[null,{"$f":"B154","v":"HECTÁREAS DE COBERTURA VEGETAL INCREMENTADAS DE LOS ECOSISTEMAS ASOCIADOS"},null,null,null,null,null,null,{"$f":"I154","v":"RECUPERACIÓN DE LA COBERTURA VEGETAL DE LOS ECOSISTEMAS ASOCIADOS"},null,null,null,null,null,null,{"$f":"P154","v":"Infraestructura natural"},null,{"$f":"W154","v":0}]
[null,{"$f":"B170","v":"HECTÁREAS DE LA ESTRUCTURA DEL SUELO RECUPERADA DE LOS ECOSISTEMAS ASOCIADOS"},null,null,null,null,null,null,{"$f":"I170","v":"RECUPERACIÓN DE LAS CARACTERÍSTICAS DEL SUELO DEL ECOSISTEMA ASOCIADO"},null,null,null,null,null,null,{"$f":"P170","v":"Infraestructura natural"},null,{"$f":"W170","v":0}]
[null,{"$f":"B176","v":"NÚMERO DE MEDIDAS DE ADAPTACIÓN AL RÉGIMEN DE PRECIPITACIONES Y TEMPERATURAS"},null,null,null,null,null,null,{"$f":"I176","v":"ADAPTACIÓN A LOS REGÍMENES DE PRECIPITACIÓN Y TEMPERATURAS"},null,null,null,null,null,null,{"$f":"P176","v":"Infraestructura natural"},null,{"$f":"W176","v":0}]
[null,{"$f":"B198","v":"POBLADORES CON ADECUADAS CAPACIDADES EN PRÁCTICAS DE MANEJO DE LOS ECOSISTEMAS DE INTERÉS HÍDRICO"},null,null,null,null,null,null,{"$f":"I198","v":"ADECUADAS PRÁCTICAS DEL MANEJO DEL ECOSISTEMA"},null,null,null,null,null,null,{"$f":"P198","v":"Intangible"},null,{"$f":"W198","v":0}]
[null,{"$f":"B213","v":"N° DE ÁREAS U ÓRGANOS ENCARGADOS DE LA GESTIÓN DEL ECOSISTEMA DE INTERÉS HÍDRICO CON ADECUADAS CAPACIDADES EN GESTIÓN DEL ECOSISTEMA"},null,null,null,null,null,null,{"$f":"I213","v":"ADECUADAS CAPACIDADES DE LAS ENTIDADES A CARGO DE LA GESTIÓN DEL ECOSISTEMA"},null,null,null,null,null,null,{"$f":"P213","v":"Intangible"},null,{"$f":"W213","v":0}]
[null,"OTROS COSTOS",null,null,null,null,null,null,null,null,null,null,null,null,null,null,null,"COSTOS SUB TOTAL EN SOLES"]
[]
[]
[null,{"$f":"B227","v":"GESTIÓN DEL PROYECTO"},null,null,null,null,null,null,{"$f":"IF(I227=\"\",\"\",I227)","v":""},null,null,null,null,null,null,null,null,{"$f":"W227","v":0}]
[null,"ESTUDIO DEFINITIVO",null,null,null,null,null,null,{"$f":"IF(B246=\"\",\"\",B246)","v":"ESTUDIO DEFINITIVO"},null,null,null,null,null,null,null,null,{"$f":"W228","v":0}]
[null,{"$f":"B229","v":"SUPERVISIÓN DE EXPEDIENTE TÉCNICO"},null,null,null,null,null,null,{"$f":"IF(I229=\"\",\"\",I229)","v":""},null,null,null,null,null,null,null,null,{"$f":"W229","v":0}]
[null,{"$f":"B230","v":"SUPERVISIÓN DE EJECUCIÓN FÍSICA DEL PROYECTO Y LIQUIDACIÓN"},null,null,null,null,null,null,{"$f":"IF(I230=\"\",\"\",I230)","v":""},null,null,null,null,null,null,null,null,{"$f":"W230","v":0}]

{"sheet":"RANGO REF.COSTOS (ECOSIS.ALTOA)","index":49,"n_rows":58,"n_cols":7,"rows_kept":58,"cut":false,"hidden":false,"merged":[[6,1,6,6],[7,1,7,2],[7,3,7,4],[7,5,7,6],[8,1,8,2],[8,3,8,4],[8,5,8,6],[9,1,9,2],[9,3,9,4],[9,5,9,6],[13,1,13,6],[14,1,14,2],[14,3,14,4],[14,5,14,6],[15,1,15,2],[15,3,15,4],[15,5,15,6],[16,1,16,2],[16,3,16,4],[16,5,16,6],[17,1,17,2],[17,3,17,4],[17,5,17,6],[21,1,21,6],[23,1,48,1],[23,2,25,2],[23,4,25,4],[23,5,25,5],[23,6,25,6],[26,2,29,2],[26,4,29,4],[26,5,29,5],[26,6,29,6],[30,2,33,2],[30,4,33,4],[30,5,33,6],[49,1,50,1],[34,2,37,2],[34,4,37,4],[34,5,37,5],[34,6,37,6],[38,2,41,2],[38,4,41,4],[38,5,41,5],[38,6,41,6],[42,2,44,2],[45,2,48,2],[45,4,48,4],[45,5,48,5],[45,6,48,6],[42,3,43,3],[57,1,57,6],[59,1,59,6],[51,1,53,1],[52,2,53,2],[52,4,53,4],[52,5,53,5],[52,6,53,6],[56,1,56,6]]}
[]
[]
[]
[]
[]
[]
[null,"1. DENSIDAD DE PLANTACIÓN Y COSTO POR HECTÁREA"]
[null,"Criterio",null," Valor mínimo ",null," Valor máximo "]
[null,"Costo directo por hectárea instalada (para especies nativas y exóticas )",null,2322,null,13953]
[null,"Densidad de plantaciones (para especies nativas y exóticas) ",null,372,null,2476]
[]
[]
[]
[null,"2. LÍNEA DE CORTE POR COMPONENTE"]
[null,"Componentes",null,"Costo mínimo ",null,"Costo máximo "]
[null,"Componente 1: Recuperación del ecosistema por hectárea",null,324286.7,null,7020011.2000000002]
[null,"Componente 2: Aprovechamiento sostenible",null,20053,null,287200]
[null,"Componente 3: Gestión del ecosistema",null,5400,null,539725.19999999995]
[]
[]
[]
[null,"3.LÍNEA DE CORTE POR ACCIÓN Y ACTIVIDAD"]
[null,"Componentes","Acciones","Actividades ","Unidad de medida","Costo mínimo","Costo máximo"]
[null,"Componente 1: Recuperación del ecosistema","Construcción del vivero","Ubicación","Soles por metro cuadrado",28.09,"S/.93.31 "]
[null,null,null,"Diseño"]
[null,null,null,"Materiales de construcción"]
[null,null,"Producción de plantones en el vivero[1]","Hoyación","Soles por plantón",0.22,"S/.1.91 "]
[null,null,null,"Escarificación de semillas"]
[null,null,null,"Siembra de semillas"]
[null,null,null,"Riego"]
[null,null,"Labores culturales en producción de plantones[2]","Repique de plántula","Soles por mes",1800]
[null,null,null,"Control fitosanitario"]
[null,null,null,"Riego"]
[null,null,null,"Deshierbos"]
[null,null,"Instalación de plantones forestales","Determinación de especie","Soles por hectárea",1171.5899999999999,1284.33]
[null,null,null,"Hoyación"]
[null,null,null,"Traslado de plantas"]
[null,null,null,"Establecimiento de plantación"]
[null,null,"Labores culturales a plantones instalados","Riego","Soles por hectárea",303,1009]
[null,null,null,"Deshierbo"]
[null,null,null,"Replante"]
[null,null,null,"Protección"]
[null,null,"Eficiente conservación y recuperación de fuentes hídricas","Construcción de zanjas de infiltración","Soles por hectárea",449,970]
[null,null,null,null,"Soles por m3",343.29,1099.79]
[null,null,null,"Instalación de terrazas de formación lenta","Soles por hectárea",359.64,382]
[null,null,"Eficiente conservación y recuperación de pastizales altoandinos.","Instalación de pastos naturales","Soles por metro cuadrado",2635,"S/.6,089 "]
[null,null,null,"Instalación de cercos de protección a pastizales"]
[null,null,null,"Rotación de dormideros portátiles"]
[null,null,null,"Abonamiento de pastos naturales"]
[null,"Componente 2: Aprovechamiento sostenible","Desarrollo de capacidades organizacionales para la gestión del recurso forestal","Constitución de asociaciones comunales para la gestión de recurso forestal.","Soles por taller",3488.89,"S/.7,270.00 "]
[null,null,"Capacitación en prácticas de producción, manejo y mantenimiento de plantaciones forestales","Talleres de capacitación","Soles por taller",600,904.1]
[null,"Componente 3: Gestión del ecosistema","Fortalecimiento de capacidades en ordenamiento territorial","Zonificación ambiental","Soles por taller",290.10000000000002,1792.83]
[null,null,"Adecuado sistema de monitoreo y seguimiento participativo","Monitoreo de suelos","Soles por mes",4951.88,5425.42]
[null,null,null,"Monitoreo de recursos hídricos"]
[]
[]
[null,"[1] Para esta sección se tomó en cuenta sólo las acciones concernientes a producción de plantones en el vivero, sin considerar las acciones ligadas a las labores de mantenimiento de las plántulas luego de su almacigo. Esto último fue considerado como labores culturales de manejo de vivero."]
[null,"[2] Esta sección considera como punto de partida dos proyectos de código SIAF: 2321585 y 2321583."]

{"sheet":"CRONOGRAMA","index":50,"n_rows":141,"n_cols":77,"rows_kept":141,"cut":false,"hidden":false,"merged":[[49,15,49,75],[49,76,51,76],[50,15,50,75],[70,1,72,5],[70,6,70,10],[71,6,71,10],[115,9,117,10],[115,11,117,12],[115,13,117,14],[115,15,115,75],[115,76,117,76],[116,15,116,75],[115,1,117,8],[53,11,53,12],[53,13,53,14],[52,1,52,8],[53,1,53,8],[49,11,51,12],[49,13,51,14],[52,9,52,10],[52,11,52,12],[52,13,52,14],[54,9,54,10],[56,1,56,12],[18,76,20,76],[102,11,102,12],[102,13,102,14],[36,11,36,12],[36,13,36,14],[102,6,102,8],[102,9,102,10],[28,6,28,8],[28,9,28,10],[28,11,28,12],[28,13,28,14],[29,6,29,8],[29,9,29,10],[29,11,29,12],[29,13,29,14],[30,6,30,8],[30,9,30,10],[30,11,30,12],[30,13,30,14],[31,6,31,8],[31,9,31,10],[31,11,31,12],[31,13,31,14],[53,9,53,10],[6,1,7,3],[7,5,7,8],[7,11,7,13],[18,1,20,5],[18,6,20,8],[18,9,20,10],[18,11,20,12],[18,13,20,14],[25,6,25,8],[25,9,25,10],[25,11,25,12],[25,13,25,14],[24,1,25,5],[24,6,24,8],[24,9,24,10],[24,11,24,12],[24,13,24,14],[7,9,7,10],[26,1,29,5],[26,6,26,8],[26,9,26,10],[18,15,18,75],[19,15,19,75],[21,1,23,5],[21,6,21,8],[21,9,21,10],[21,11,21,12],[21,13,21,14],[22,6,22,8],[22,9,22,10],[22,11,22,12],[22,13,22,14],[23,6,23,8],[23,9,23,10],[23,11,23,12],[23,13,23,14],[26,11,26,12],[26,13,26,14],[27,6,27,8],[27,9,27,10],[27,11,27,12],[27,13,27,14],[32,1,37,5],[32,6,32,8],[32,9,32,10],[32,11,32,12],[32,13,32,14],[33,6,33,8],[30,1,31,5],[35,6,35,8],[35,9,35,10],[35,11,35,12],[35,13,35,14],[37,6,37,8],[37,9,37,10],[37,11,37,12],[37,13,37,14],[33,9,33,10],[33,11,33,12],[33,13,33,14],[34,6,34,8],[34,9,34,10],[34,11,34,12],[34,13,34,14],[38,1,43,5],[38,6,38,8],[36,6,36,8],[36,9,36,10],[43,6,43,8],[43,9,43,10],[43,11,43,12],[43,13,43,14],[40,9,40,10],[40,11,40,12],[40,13,40,14],[41,6,41,8],[41,9,41,10],[41,11,41,12],[38,9,38,10],[38,11,38,12],[38,13,38,14],[39,6,39,8],[39,9,39,10],[39,11,39,12],[39,13,39,14],[40,6,40,8],[42,6,42,8],[42,9,42,10],[44,1,48,5],[44,6,44,8],[44,9,44,10],[44,11,44,12],[44,13,44,14],[45,6,45,8],[45,9,45,10],[45,11,45,12],[45,13,45,14],[46,6,46,8],[48,6,48,8],[48,9,48,10],[48,11,48,12],[48,13,48,14],[41,13,41,14],[46,9,46,10],[46,11,46,12],[46,13,46,14],[47,6,47,8],[47,9,47,10],[47,11,47,12],[47,13,47,14],[42,11,42,12],[42,13,42,14],[54,1,54,8],[55,1,55,8],[56,13,56,14],[60,1,62,5],[60,6,60,10],[61,6,61,10],[54,11,54,12],[54,13,54,14],[55,9,55,10],[69,1,69,5],[73,1,73,5],[74,1,74,5],[75,1,75,5],[76,1,76,5],[55,11,55,12],[55,13,55,14],[64,1,64,5],[65,1,65,5],[66,1,66,5],[67,1,67,5],[68,1,68,5],[63,1,63,5],[57,1,57,23],[88,13,88,14],[84,11,86,12],[84,13,86,14],[84,15,84,75],[85,15,85,75],[77,1,77,5],[80,1,81,3],[80,4,81,9],[84,1,86,5],[84,6,86,8],[84,9,86,10],[94,9,94,10],[94,11,94,12],[84,76,86,76],[89,6,89,8],[89,9,89,10],[89,11,89,12],[89,13,89,14],[90,1,91,5],[90,6,90,8],[90,9,90,10],[90,11,90,12],[90,13,90,14],[91,6,91,8],[91,9,91,10],[91,11,91,12],[91,13,91,14],[87,1,89,5],[87,6,87,8],[87,9,87,10],[87,11,87,12],[87,13,87,14],[88,6,88,8],[88,9,88,10],[88,11,88,12],[92,1,95,5],[92,6,92,8],[92,9,92,10],[92,11,92,12],[92,13,92,14],[97,6,97,8],[97,9,97,10],[97,11,97,12],[97,13,97,14],[94,13,94,14],[96,13,96,14],[96,1,97,5],[96,6,96,8],[96,9,96,10],[96,11,96,12],[93,6,93,8],[95,6,95,8],[95,9,95,10],[95,11,95,12],[95,13,95,14],[93,9,93,10],[93,11,93,12],[93,13,93,14],[94,6,94,8],[99,6,99,8],[99,9,99,10],[99,11,99,12],[99,13,99,14],[98,1,103,5],[98,6,98,8],[98,9,98,10],[98,11,98,12],[98,13,98,14],[100,6,100,8],[100,9,100,10],[100,11,100,12],[100,13,100,14],[103,6,103,8],[103,9,103,10],[103,11,103,12],[103,13,103,14],[101,6,101,8],[101,9,101,10],[101,11,101,12],[101,13,101,14],[104,9,104,10],[104,11,104,12],[104,13,104,14],[106,6,106,8],[106,9,106,10],[106,11,106,12],[106,13,106,14],[109,6,109,8],[109,9,109,10],[109,11,109,12],[109,13,109,14],[107,6,107,8],[107,9,107,10],[107,11,107,12],[107,13,107,14],[105,6,105,8],[105,9,105,10],[105,11,105,12],[105,13,105,14],[108,6,108,8],[108,9,108,10],[108,11,108,12],[108,13,108,14],[110,13,110,14],[112,6,112,8],[112,9,112,10],[112,11,112,12],[112,13,112,14],[114,6,114,8],[114,9,114,10],[114,11,114,12],[114,13,114,14],[113,6,113,8],[113,9,113,10],[113,11,113,12],[113,13,113,14],[121,13,121,14],[121,1,121,8],[104,1,109,5],[104,6,104,8],[118,9,118,10],[118,11,118,12],[118,13,118,14],[118,1,118,8],[120,9,120,10],[120,11,120,12],[120,13,120,14],[119,9,119,10],[119,11,119,12],[119,13,119,14],[119,1,119,8],[120,1,120,8],[111,6,111,8],[111,9,111,10],[111,11,111,12],[111,13,111,14],[110,1,114,5],[110,6,110,8],[110,9,110,10],[110,11,110,12],[129,11,129,12],[124,1,126,5],[124,6,124,10],[124,11,126,12],[125,6,125,10],[127,1,127,5],[127,11,127,12],[121,9,121,10],[121,11,121,12],[49,1,51,10],[138,1,138,5],[138,11,138,12],[139,1,139,5],[139,11,139,12],[140,1,140,5],[140,11,140,12],[133,1,133,5],[133,11,133,12],[137,1,137,5],[137,11,137,12],[134,1,136,5],[134,6,134,10],[134,11,136,12],[135,6,135,10],[130,1,130,5],[130,11,130,12],[131,1,131,5],[131,11,131,12],[132,1,132,5],[132,11,132,12],[128,1,128,5],[128,11,128,12],[129,1,129,5]]}
[]
[]
[]
[]
[]
[]
[]
[null,null,null,null,null,"PRIMERO INDIQUE EN QUE PERIODO SE VA A TRABAJAR ",null,null,null,"PERIODO",null,"MES"]
[]
[]
[]
[null,"EJECUCIÓN FINACIERA"]
[]
[]
[null,"CRONOGRAMA DE META FÍSICA POR COMPONENTE"]
[]
[]
[]
[null,"COMPONENTE",null,null,null,null,"ACCION",null,null,"TIPO DE FACTOR PRODUCTIVO",null,"CANTIDAD",null,"COSTOS SUB TOTAL EN SOLES",null,{"$f":"L8","v":"MES"},null,null,null,null,null,null,null,null,null,null,null,null,null,null,null,null,null,null,null,null,null,null,null,null,null,null,null,null,null,null,null,null,null,null,null,null,null,null,null,null,null,null,null,null,null,null,null,null,null,null,null,null,null,null,null,null,null,null,null,null,"TOTAL"]
[null,null,null,null,null,null,null,null,null,null,null,null,null,null,null,"PERIODO"]
[null,null,null,null,null,null,null,null,null,null,null,null,null,null,null,1,2,3,4,5,6,7,8,9,10,11,12,13,14,15,16,17,18,19,20,21,22,23,24,25,26,27,28,29,30,31,32,33,34,35,36,37,38,39,40,41,42,43,44,45,46,47,48,49,50,51,52,53,54,55,56,57,58,59,60,"N"]
[null,{"$f":"IF('6.PROBLEMA-OBJETIVO'!C102=\"\",\"\",'6.PROBLEMA-OBJETIVO'!C102)","v":"RECUPERACIÓN DE LA COBERTURA VEGETAL NATIVA DEL ECOSISTEMA PRINCIPAL"},null,null,null,null,{"$f":"'8.ANALISIS TÉCNICO'!D73","v":"REVEGETACIÓN CON ESPECIES NATIVAS"},null,null,{"$f":"'8.ANALISIS TÉCNICO'!H73","v":"Infraestructura Natural"},null,{"$f":"'COSTOS UNITARIOS'!S12","v":0},null,{"$f":"'COSTOS UNITARIOS'!W12","v":0},null,null,null,null,null,null,null,null,null,null,null,null,null,null,null,null,null,null,null,null,null,null,null,null,null,null,null,null,null,null,null,null,null,null,null,null,null,null,null,null,null,null,null,null,null,null,null,null,null,null,null,null,null,null,null,null,null,null,null,null,null,null,{"$f":"SUM(P22:BX22)","v":0}]
[null,null,null,null,null,null,{"$f":"'8.ANALISIS TÉCNICO'!D74","v":"INSTALACIÓN DE CERCOS EXCLUIDORES"},null,null,{"$f":"'8.ANALISIS TÉCNICO'!H74","v":"Infraestructura"},null,{"$f":"'COSTOS UNITARIOS'!S15","v":0},null,{"$f":"'COSTOS UNITARIOS'!W15","v":0},null,null,null,null,null,null,null,null,null,null,null,null,null,null,null,null,null,null,null,null,null,null,null,null,null,null,null,null,null,null,null,null,null,null,null,null,null,null,null,null,null,null,null,null,null,null,null,null,null,null,null,null,null,null,null,null,null,null,null,null,null,null,{"$f":"SUM(P23:BX23)","v":0}]
[null,null,null,null,null,null,{"$f":"'8.ANALISIS TÉCNICO'!D75","v":"OTRO:"},null,null,{"$f":"'8.ANALISIS TÉCNICO'!H75","v":0},null,{"$f":"'COSTOS UNITARIOS'!S19","v":0},null,{"$f":"'COSTOS UNITARIOS'!W19","v":0},null,null,null,null,null,null,null,null,null,null,null,null,null,null,null,null,null,null,null,null,null,null,null,null,null,null,null,null,null,null,null,null,null,null,null,null,null,null,null,null,null,null,null,null,null,null,null,null,null,null,null,null,null,null,null,null,null,null,null,null,null,null,0]
[null,{"$f":"IF('6.PROBLEMA-OBJETIVO'!C105=\"\",\"\",'6.PROBLEMA-OBJETIVO'!C105)","v":"RECUPERACIÓN DE LAS CARACTERÍSTICAS DE LA TURBA DEL ECOSISTEMA PRINCIPAL"},null,null,null,null,{"$f":"'8.ANALISIS TÉCNICO'!D76","v":"REVEGETACIÓN CON ESPECIES NATIVAS"},null,null,{"$f":"'8.ANALISIS TÉCNICO'!H76","v":"Infraestructura Natural"},null,{"$f":"'COSTOS UNITARIOS'!S22","v":0},null,{"$f":"'COSTOS UNITARIOS'!W22","v":0},null,null,null,null,null,null,null,null,null,null,null,null,null,null,null,null,null,null,null,null,null,null,null,null,null,null,null,null,null,null,null,null,null,null,null,null,null,null,null,null,null,null,null,null,null,null,null,null,null,null,null,null,null,null,null,null,null,null,null,null,null,null,0]
[null,null,null,null,null,null,{"$f":"'8.ANALISIS TÉCNICO'!D77","v":"OTRO:"},null,null,{"$f":"'8.ANALISIS TÉCNICO'!H77","v":0},null,{"$f":"'COSTOS UNITARIOS'!S25","v":0},null,{"$f":"'COSTOS UNITARIOS'!W25","v":0},null,null,null,null,null,null,null,null,null,null,null,null,null,null,null,null,null,null,null,null,null,null,null,null,null,null,null,null,null,null,null,null,null,null,null,null,null,null,null,null,null,null,null,null,null,null,null,null,null,null,null,null,null,null,null,null,null,null,null,null,null,null,0]
[null,{"$f":"IF('6.PROBLEMA-OBJETIVO'!C107=\"\",\"\",'6.PROBLEMA-OBJETIVO'!C107)","v":"RECUPERACIÓN DE LA COBERTURA VEGETAL DE LOS ECOSISTEMAS ASOCIADOS"},null,null,null,null,{"$f":"'8.ANALISIS TÉCNICO'!D78","v":"REFORESTACIÓN CON ESPECIES NATIVAS"},null,null,{"$f":"'8.ANALISIS TÉCNICO'!H78","v":"Infraestructura Natural"},null,{"$f":"'COSTOS UNITARIOS'!S28","v":0},null,{"$f":"'COSTOS UNITARIOS'!W28","v":0},null,null,null,null,null,null,null,null,null,null,null,null,null,null,null,null,null,null,null,null,null,null,null,null,null,null,null,null,null,null,null,null,null,null,null,null,null,null,null,null,null,null,null,null,null,null,null,null,null,null,null,null,null,null,null,null,null,null,null,null,null,null,0]
[null,null,null,null,null,null,{"$f":"'8.ANALISIS TÉCNICO'!D79","v":"REVEGETACIÓN CON ESPECIES NATIVAS"},null,null,{"$f":"'8.ANALISIS TÉCNICO'!H79","v":"Infraestructura Natural"},null,{"$f":"'COSTOS UNITARIOS'!S34","v":0},null,{"$f":"'COSTOS UNITARIOS'!W34","v":0},null,null,null,null,null,null,null,null,null,null,null,null,null,null,null,null,null,null,null,null,null,null,null,null,null,null,null,null,null,null,null,null,null,null,null,null,null,null,null,null,null,null,null,null,null,null,null,null,null,null,null,null,null,null,null,null,null,null,null,null,null,null,0]
[null,null,null,null,null,null,{"$f":"'8.ANALISIS TÉCNICO'!D80","v":"INSTALACIÓN DE CERCOS EXCLUIDORES"},null,null,{"$f":"'8.ANALISIS TÉCNICO'!H80","v":"Infraestructura"},null,{"$f":"'COSTOS UNITARIOS'!S37","v":0},null,{"$f":"'COSTOS UNITARIOS'!W37","v":0},null,null,null,null,null,null,null,null,null,null,null,null,null,null,null,null,null,null,null,null,null,null,null,null,null,null,null,null,null,null,null,null,null,null,null,null,null,null,null,null,null,null,null,null,null,null,null,null,null,null,null,null,null,null,null,null,null,null,null,null,null,null,0]
[null,null,null,null,null,null,{"$f":"'8.ANALISIS TÉCNICO'!D81","v":"OTRO:"},null,null,{"$f":"'8.ANALISIS TÉCNICO'!H81","v":0},null,{"$f":"'COSTOS UNITARIOS'!S41","v":0},null,{"$f":"'COSTOS UNITARIOS'!W41","v":0},null,null,null,null,null,null,null,null,null,null,null,null,null,null,null,null,null,null,null,null,null,null,null,null,null,null,null,null,null,null,null,null,null,null,null,null,null,null,null,null,null,null,null,null,null,null,null,null,null,null,null,null,null,null,null,null,null,null,null,null,null,null,0]
[null,{"$f":"IF('6.PROBLEMA-OBJETIVO'!C111=\"\",\"\",'6.PROBLEMA-OBJETIVO'!C111)","v":"RECUPERACIÓN DE LAS CARACTERÍSTICAS DEL SUELO DEL ECOSISTEMA ASOCIADO"},null,null,null,null,{"$f":"'8.ANALISIS TÉCNICO'!D82","v":"ENRIQUECIMIENTO DE SUELOS"},null,null,{"$f":"'8.ANALISIS TÉCNICO'!H82","v":"Infraestructura Natural"},null,{"$f":"'COSTOS UNITARIOS'!S44","v":0},null,{"$f":"'COSTOS UNITARIOS'!W44","v":0},null,null,null,null,null,null,null,null,null,null,null,null,null,null,null,null,null,null,null,null,null,null,null,null,null,null,null,null,null,null,null,null,null,null,null,null,null,null,null,null,null,null,null,null,null,null,null,null,null,null,null,null,null,null,null,null,null,null,null,null,null,null,0]
[null,null,null,null,null,null,{"$f":"'8.ANALISIS TÉCNICO'!D83","v":"OTRO:"},null,null,{"$f":"'8.ANALISIS TÉCNICO'!H83","v":0},null,{"$f":"'COSTOS UNITARIOS'!S49","v":0},null,{"$f":"'COSTOS UNITARIOS'!W49","v":0},null,null,null,null,null,null,null,null,null,null,null,null,null,null,null,null,null,null,null,null,null,null,null,null,null,null,null,null,null,null,null,null,null,null,null,null,null,null,null,null,null,null,null,null,null,null,null,null,null,null,null,null,null,null,null,null,null,null,null,null,null,null,0]
[null,{"$f":"IF('6.PROBLEMA-OBJETIVO'!C113=\"\",\"\",'6.PROBLEMA-OBJETIVO'!C113)","v":"ADAPTACIÓN A LOS REGÍMENES DE PRECIPITACIÓN Y TEMPERATURAS"},null,null,null,null,{"$f":"'8.ANALISIS TÉCNICO'!D84","v":"REPARACIÓN DEL CANAL AMUNADOR"},null,null,{"$f":"'8.ANALISIS TÉCNICO'!H84","v":"Infraestructura Natural"},null,{"$f":"'COSTOS UNITARIOS'!S52","v":0},null,{"$f":"'COSTOS UNITARIOS'!W52","v":0},null,null,null,null,null,null,null,null,null,null,null,null,null,null,null,null,null,null,null,null,null,null,null,null,null,null,null,null,null,null,null,null,null,null,null,null,null,null,null,null,null,null,null,null,null,null,null,null,null,null,null,null,null,null,null,null,null,null,null,null,null,null,0]
[null,null,null,null,null,null,{"$f":"'8.ANALISIS TÉCNICO'!D85","v":"REPARACIÓN DEL CANAL DE MAMANTEO"},null,null,{"$f":"'8.ANALISIS TÉCNICO'!H85","v":"Infraestructura Natural"},null,{"$f":"'COSTOS UNITARIOS'!S56","v":0},null,{"$f":"'COSTOS UNITARIOS'!W56","v":0},null,null,null,null,null,null,null,null,null,null,null,null,null,null,null,null,null,null,null,null,null,null,null,null,null,null,null,null,null,null,null,null,null,null,null,null,null,null,null,null,null,null,null,null,null,null,null,null,null,null,null,null,null,null,null,null,null,null,null,null,null,null,0]
[null,null,null,null,null,null,{"$f":"'8.ANALISIS TÉCNICO'!D86","v":"CONSTRUCCIÓN DE ZANJAS DE INFILTRACIÓN"},null,null,{"$f":"'8.ANALISIS TÉCNICO'!H86","v":"Infraestructura Natural"},null,{"$f":"'COSTOS UNITARIOS'!S60","v":0},null,{"$f":"'COSTOS UNITARIOS'!W60","v":0},null,null,null,null,null,null,null,null,null,null,null,null,null,null,null,null,null,null,null,null,null,null,null,null,null,null,null,null,null,null,null,null,null,null,null,null,null,null,null,null,null,null,null,null,null,null,null,null,null,null,null,null,null,null,null,null,null,null,null,null,null,null,0]
[null,null,null,null,null,null,{"$f":"'8.ANALISIS TÉCNICO'!D87","v":"INSTALACIÓN DE QOCHAS"},null,null,{"$f":"'8.ANALISIS TÉCNICO'!H87","v":"Infraestructura Natural"},null,{"$f":"'COSTOS UNITARIOS'!S64","v":0},null,{"$f":"'COSTOS UNITARIOS'!W64","v":0},null,null,null,null,null,null,null,null,null,null,null,null,null,null,null,null,null,null,null,null,null,null,null,null,null,null,null,null,null,null,null,null,null,null,null,null,null,null,null,null,null,null,null,null,null,null,null,null,null,null,null,null,null,null,null,null,null,null,null,null,null,null,{"$f":"SUM(P36:BX36)","v":0}]
[null,null,null,null,null,null,{"$f":"'8.ANALISIS TÉCNICO'!D88","v":"CONSTRUCCIÓN DE TERRAZAS DE FORMACIÓN DE SUELOS"},null,null,{"$f":"'8.ANALISIS TÉCNICO'!H88","v":"Infraestructura Natural"},null,{"$f":"'COSTOS UNITARIOS'!S65","v":0},null,{"$f":"'COSTOS UNITARIOS'!W65","v":0},null,null,null,null,null,null,null,null,null,null,null,null,null,null,null,null,null,null,null,null,null,null,null,null,null,null,null,null,null,null,null,null,null,null,null,null,null,null,null,null,null,null,null,null,null,null,null,null,null,null,null,null,null,null,null,null,null,null,null,null,null,null,{"$f":"SUM(P37:BX37)","v":0}]
[null,null,null,null,null,null,{"$f":"'8.ANALISIS TÉCNICO'!D89","v":"OTRO:"},null,null,{"$f":"'8.ANALISIS TÉCNICO'!H89","v":0},null,{"$f":"'COSTOS UNITARIOS'!S71","v":0},null,{"$f":"'COSTOS UNITARIOS'!W71","v":0},null,null,null,null,null,null,null,null,null,null,null,null,null,null,null,null,null,null,null,null,null,null,null,null,null,null,null,null,null,null,null,null,null,null,null,null,null,null,null,null,null,null,null,null,null,null,null,null,null,null,null,null,null,null,null,null,null,null,null,null,null,null,0]
[null,{"$f":"IF('6.PROBLEMA-OBJETIVO'!C119=\"\",\"\",'6.PROBLEMA-OBJETIVO'!C119)","v":"ADECUADAS PRÁCTICAS DEL MANEJO DEL ECOSISTEMA"},null,null,null,null,{"$f":"'8.ANALISIS TÉCNICO'!D90","v":"CAPACITACIÓN EN GESTIÓN INTEGRADA DE RECURSOS HÍDRICOS CON ENFOQUE DE CUENCA"},null,null,{"$f":"'8.ANALISIS TÉCNICO'!H90","v":"Intangible"},null,{"$f":"'COSTOS UNITARIOS'!S74","v":0},null,{"$f":"'COSTOS UNITARIOS'!W74","v":0},null,null,null,null,null,null,null,null,null,null,null,null,null,null,null,null,null,null,null,null,null,null,null,null,null,null,null,null,null,null,null,null,null,null,null,null,null,null,null,null,null,null,null,null,null,null,null,null,null,null,null,null,null,null,null,null,null,null,null,null,null,null,{"$f":"SUM(P39:BX39)","v":0}]
[null,null,null,null,null,null,{"$f":"'8.ANALISIS TÉCNICO'!D91","v":"ASISTENCIA TÉCNICA EN EL MANEJO DE ECOSISTEMAS DE INTERÉS HÍDRICO"},null,null,{"$f":"'8.ANALISIS TÉCNICO'!H91","v":"Intangible"},null,{"$f":"'COSTOS UNITARIOS'!S77","v":0},null,{"$f":"'COSTOS UNITARIOS'!W77","v":0},null,null,null,null,null,null,null,null,null,null,null,null,null,null,null,null,null,null,null,null,null,null,null,null,null,null,null,null,null,null,null,null,null,null,null,null,null,null,null,null,null,null,null,null,null,null,null,null,null,null,null,null,null,null,null,null,null,null,null,null,null,null,0]
[null,null,null,null,null,null,{"$f":"'8.ANALISIS TÉCNICO'!D92","v":"CAPACITACIÓN EN BUENAS PRÁCTICAS PARA LA ADAPTACIÓN AL CAMBIO CLIMÁTICO Y GESTIÓN DE RIESGOS"},null,null,{"$f":"'8.ANALISIS TÉCNICO'!H92","v":"Intangible"},null,{"$f":"'COSTOS UNITARIOS'!S80","v":0},null,{"$f":"'COSTOS UNITARIOS'!W80","v":0},null,null,null,null,null,null,null,null,null,null,null,null,null,null,null,null,null,null,null,null,null,null,null,null,null,null,null,null,null,null,null,null,null,null,null,null,null,null,null,null,null,null,null,null,null,null,null,null,null,null,null,null,null,null,null,null,null,null,null,null,null,null,0]
[null,null,null,null,null,null,{"$f":"'8.ANALISIS TÉCNICO'!D93","v":"SENSIBILIZACIÓN RELACIONADA A LA RECUPERACIÓN DEL SERVICIO ECOSISTÉMICO DE REGULACIÓN HÍDRICA"},null,null,{"$f":"'8.ANALISIS TÉCNICO'!H93","v":"Intangible"},null,{"$f":"'COSTOS UNITARIOS'!S82","v":0},null,{"$f":"'COSTOS UNITARIOS'!W82","v":0},null,null,null,null,null,null,null,null,null,null,null,null,null,null,null,null,null,null,null,null,null,null,null,null,null,null,null,null,null,null,null,null,null,null,null,null,null,null,null,null,null,null,null,null,null,null,null,null,null,null,null,null,null,null,null,null,null,null,null,null,null,null,0]
[null,null,null,null,null,null,{"$f":"'8.ANALISIS TÉCNICO'!D94","v":"INTERCAMBIO DE EXPERIENCIAS RELACIONADA A LA RECUPERACIÓN DEL SERVICIO ECOSISTÉMICO DE REGULACIÓN HÍDRICA"},null,null,{"$f":"'8.ANALISIS TÉCNICO'!H94","v":"Intangible"},null,{"$f":"'COSTOS UNITARIOS'!S84","v":0},null,{"$f":"'COSTOS UNITARIOS'!W84","v":0},null,null,null,null,null,null,null,null,null,null,null,null,null,null,null,null,null,null,null,null,null,null,null,null,null,null,null,null,null,null,null,null,null,null,null,null,null,null,null,null,null,null,null,null,null,null,null,null,null,null,null,null,null,null,null,null,null,null,null,null,null,null,0]
[null,null,null,null,null,null,{"$f":"'8.ANALISIS TÉCNICO'!D95","v":"OTRO:"},null,null,{"$f":"'8.ANALISIS TÉCNICO'!H95","v":0},null,{"$f":"'COSTOS UNITARIOS'!S86","v":0},null,{"$f":"'COSTOS UNITARIOS'!W86","v":0},null,null,null,null,null,null,null,null,null,null,null,null,null,null,null,null,null,null,null,null,null,null,null,null,null,null,null,null,null,null,null,null,null,null,null,null,null,null,null,null,null,null,null,null,null,null,null,null,null,null,null,null,null,null,null,null,null,null,null,null,null,null,0]
[null,{"$f":"IF('6.PROBLEMA-OBJETIVO'!C125=\"\",\"\",'6.PROBLEMA-OBJETIVO'!C125)","v":"ADECUADAS CAPACIDADES DE LAS ENTIDADES A CARGO DE LA GESTIÓN DEL ECOSISTEMA"},null,null,null,null,{"$f":"'8.ANALISIS TÉCNICO'!D96","v":"CAPACITACIÓN A FUNCIONARIOS PÚBLICOS SOBRE LA GESTIÓN INTEGRADA DEL RECURSO HÍDRICO CON ENFOQUE DE CUENCA"},null,null,{"$f":"'8.ANALISIS TÉCNICO'!H96","v":"Intangible"},null,{"$f":"'COSTOS UNITARIOS'!S89","v":0},null,{"$f":"'COSTOS UNITARIOS'!W89","v":0},null,null,null,null,null,null,null,null,null,null,null,null,null,null,null,null,null,null,null,null,null,null,null,null,null,null,null,null,null,null,null,null,null,null,null,null,null,null,null,null,null,null,null,null,null,null,null,null,null,null,null,null,null,null,null,null,null,null,null,null,null,null,0]
[null,null,null,null,null,null,{"$f":"'8.ANALISIS TÉCNICO'!D97","v":"CAPACITACIÓN A FUNCIONARIOS PÚBLICOS SOBRE LAS MEDIDAS DE ADAPTACIÓN EN UN CONTEXTO DE CAMBIO CLIMÁTICO EN LA GESTIÓN INTEGRADA DE LOS RECURSOS HÍDRICOS"},null,null,{"$f":"'8.ANALISIS TÉCNICO'!H97","v":"Intangible"},null,{"$f":"'COSTOS UNITARIOS'!S91","v":0},null,{"$f":"'COSTOS UNITARIOS'!W91","v":0},null,null,null,null,null,null,null,null,null,null,null,null,null,null,null,null,null,null,null,null,null,null,null,null,null,null,null,null,null,null,null,null,null,null,null,null,null,null,null,null,null,null,null,null,null,null,null,null,null,null,null,null,null,null,null,null,null,null,null,null,null,null,0]
[null,null,null,null,null,null,{"$f":"'8.ANALISIS TÉCNICO'!D98","v":"DESARROLLO DE CAPACIDADES PARA EL MONITOREO Y SEGUIMIENTO DE LOS ECOSISTEMAS DE INTERÉS HÍDRICO Y EL SERVICIO ECOSISTÉMICO DE REGULACIÓN HÍDRICA"},null,null,{"$f":"'8.ANALISIS TÉCNICO'!H98","v":"Intangible"},null,{"$f":"'COSTOS UNITARIOS'!S93","v":0},null,{"$f":"'COSTOS UNITARIOS'!W93","v":0},null,null,null,null,null,null,null,null,null,null,null,null,null,null,null,null,null,null,null,null,null,null,null,null,null,null,null,null,null,null,null,null,null,null,null,null,null,null,null,null,null,null,null,null,null,null,null,null,null,null,null,null,null,null,null,null,null,null,null,null,null,null,0]
[null,null,null,null,null,null,{"$f":"'8.ANALISIS TÉCNICO'!D99","v":"INTERCAMBIO DE EXPERIENCIAS SOBRE LA GESTIÓN INTEGRADA DEL RECURSO HÍDRICO CON ENFOQUE DE CUENCA"},null,null,{"$f":"'8.ANALISIS TÉCNICO'!H99","v":"Intangible"},null,{"$f":"'COSTOS UNITARIOS'!S95","v":0},null,{"$f":"'COSTOS UNITARIOS'!W95","v":0},null,null,null,null,null,null,null,null,null,null,null,null,null,null,null,null,null,null,null,null,null,null,null,null,null,null,null,null,null,null,null,null,null,null,null,null,null,null,null,null,null,null,null,null,null,null,null,null,null,null,null,null,null,null,null,null,null,null,null,null,null,null,{"$f":"SUM(P48:BX48)","v":0}]
[null,null,null,null,null,null,{"$f":"'8.ANALISIS TÉCNICO'!D100","v":"OTRO:"},null,null,{"$f":"'8.ANALISIS TÉCNICO'!H100","v":0},null,{"$f":"'COSTOS UNITARIOS'!S97","v":0},null,{"$f":"'COSTOS UNITARIOS'!W97","v":0},null,null,null,null,null,null,null,null,null,null,null,null,null,null,null,null,null,null,null,null,null,null,null,null,null,null,null,null,null,null,null,null,null,null,null,null,null,null,null,null,null,null,null,null,null,null,null,null,null,null,null,null,null,null,null,null,null,null,null,null,null,null,0]
[null,"OTROS COSTOS",null,null,null,null,null,null,null,null,null,"CANTIDAD",null,"COSTOS SUB TOTAL EN SOLES",null,{"$f":"L39","v":0},null,null,null,null,null,null,null,null,null,null,null,null,null,null,null,null,null,null,null,null,null,null,null,null,null,null,null,null,null,null,null,null,null,null,null,null,null,null,null,null,null,null,null,null,null,null,null,null,null,null,null,null,null,null,null,null,null,null,null,null,"TOTAL"]
[null,null,null,null,null,null,null,null,null,null,null,null,null,null,null,"PERIODO"]
[null,null,null,null,null,null,null,null,null,null,null,null,null,null,null,1,2,3,4,5,6,7,8,9,10,11,12,13,14,15,16,17,18,19,20,21,22,23,24,25,26,27,28,29,30,31,32,33,34,35,36,37,38,39,40,41,42,43,44,45,46,47,48,49,50,51,52,53,54,55,56,57,58,59,60,"N"]
[null,"GESTIÓN DEL PROYECTO",null,null,null,null,null,null,null,null,null,1,null,{"$f":"'COSTOS UNITARIOS'!W103","v":0},null,null,null,null,null,null,null,null,null,null,null,null,null,null,null,null,null,null,null,null,null,null,null,null,null,null,null,null,null,null,null,null,null,null,null,null,null,null,null,null,null,null,null,null,null,null,null,null,null,null,null,null,null,null,null,null,null,null,null,null,null,null,{"$f":"SUM(P53:BX53)","v":0}]
[null,"EXPEDIENTE TÉCNICO",null,null,null,null,null,null,null,null,null,1,null,{"$f":"'COSTOS UNITARIOS'!W104","v":0},null,null,null,null,null,null,null,null,null,null,null,null,null,null,null,null,null,null,null,null,null,null,null,null,null,null,null,null,null,null,null,null,null,null,null,null,null,null,null,null,null,null,null,null,null,null,null,null,null,null,null,null,null,null,null,null,null,null,null,null,null,null,0]
[null,"SUPERVISIÓN DE EXPEDIENTE TÉCNICO",null,null,null,null,null,null,null,null,null,1,null,{"$f":"'COSTOS UNITARIOS'!W105","v":0},null,null,null,null,null,null,null,null,null,null,null,null,null,null,null,null,null,null,null,null,null,null,null,null,null,null,null,null,null,null,null,null,null,null,null,null,null,null,null,null,null,null,null,null,null,null,null,null,null,null,null,null,null,null,null,null,null,null,null,null,null,null,0]
[null,"SUPERVISIÓN DE EJECUCIÓN FÍSICA DEL PROYECTO Y LIQUIDACIÓN",null,null,null,null,null,null,null,null,null,1,null,{"$f":"'COSTOS UNITARIOS'!W106","v":0},null,null,null,null,null,null,null,null,null,null,null,null,null,null,null,null,null,null,null,null,null,null,null,null,null,null,null,null,null,null,null,null,null,null,null,null,null,null,null,null,null,null,null,null,null,null,null,null,null,null,null,null,null,null,null,null,null,null,null,null,null,null,0]
[null,"INVERSIÓN TOTAL",null,null,null,null,null,null,null,null,null,null,null,{"$f":"SUM(N22:O56)","v":0},null,{"$f":"SUM(P22:P49)+SUM(P53:P56)","v":0},{"$f":"SUM(Q22:Q49)+SUM(Q53:Q56)","v":0},0,0,0,0,0,0,0,0,0,0,0,0,0,0,0,0,0,0,0,0,0,0,0,0,0,0,0,0,0,0,0,0,0,0,0,0,0,0,0,0,0,0,0,0,0,0,0,0,0,0,0,0,0,0,0,0,0,0,0,{"$f":"SUM(P57:BX57)","v":0}]
[null,"(*) Las acciones asociadas al factor de producción \"Infraestructura Natural\" corresponden a la naturaleza \"Adecuación\", mientras que las acciones asociadas al factor de producción \"Intangible\" corresponden a la naturaleza \"Implementación\". Estas consideraciones han sido desarrolladas en base a la Tabla 2.22 de la \"Guía General para la Identificación, Formulación y Evaluación de Proyectos de Inversión\" del Invierte.pe."]
[null,"RESUMEN"]
[]
[null,"COMPONENTE",null,null,null,null,"AÑO"]
[null,null,null,null,null,null,"PERIODO"]
[null,null,null,null,null,null,1,2,3,4,5]
[null,{"$f":"B22","v":"RECUPERACIÓN DE LA COBERTURA VEGETAL NATIVA DEL ECOSISTEMA PRINCIPAL"},null,null,null,null,{"$f":"IF($L$8=\"MES\",SUM(P22:AA24),IF($L$8=\"BIMESTRE\",SUM(P22:U24),IF($L$8=\"TRIMESTRE\",SUM(P22:S24),IF($L$8=\"SEMESTRE\",SUM(P22:Q24),IF($L$8=\"AÑO\",SUM(P22:P24))))))","v":0},{"$f":"IF($L$8=\"MES\",SUM(AB22:AM24),IF($L$8=\"BIMESTRE\",SUM(V22:AA24),IF($L$8=\"TRIMESTRE\",SUM(T22:W24),IF($L$8=\"SEMESTRE\",SUM(R22:S24),IF($L$8=\"AÑO\",SUM(Q22:Q24))))))","v":0},{"$f":"IF($L$8=\"MES\",SUM(AN22:AY24),IF($L$8=\"BIMESTRE\",SUM(AB22:AG24),IF($L$8=\"TRIMESTRE\",SUM(X22:AA24),IF($L$8=\"SEMESTRE\",SUM(T22:U24),IF($L$8=\"AÑO\",SUM(R22:R24))))))","v":0},{"$f":"IF($L$8=\"MES\",SUM(AZ22:BK24),IF($L$8=\"BIMESTRE\",SUM(AH22:AM24),IF($L$8=\"TRIMESTRE\",SUM(AB22:AE24),IF($L$8=\"SEMESTRE\",SUM(V22:W24),IF($L$8=\"AÑO\",SUM(S22:S24))))))","v":0},{"$f":"IF($L$8=\"MES\",SUM(BL22:BW24),IF($L$8=\"BIMESTRE\",SUM(AN22:AS24),IF($L$8=\"TRIMESTRE\",SUM(AF22:AI24),IF($L$8=\"SEMESTRE\",SUM(X22:Y24),IF($L$8=\"AÑO\",SUM(T22:T24))))))","v":0}]
[null,{"$f":"B25","v":"RECUPERACIÓN DE LAS CARACTERÍSTICAS DE LA TURBA DEL ECOSISTEMA PRINCIPAL"},null,null,null,null,{"$f":"IF($L$8=\"MES\",SUM(P25:AA26),IF($L$8=\"BIMESTRE\",SUM(P25:U26),IF($L$8=\"TRIMESTRE\",SUM(P25:S26),IF($L$8=\"SEMESTRE\",SUM(P25:Q26),IF($L$8=\"AÑO\",SUM(P25:P26))))))","v":0},{"$f":"IF($L$8=\"MES\",SUM(AB25:AM26),IF($L$8=\"BIMESTRE\",SUM(V25:AA26),IF($L$8=\"TRIMESTRE\",SUM(T25:W26),IF($L$8=\"SEMESTRE\",SUM(R25:S26),IF($L$8=\"AÑO\",SUM(Q25:Q26))))))","v":0},{"$f":"IF($L$8=\"MES\",SUM(AN25:AY26),IF($L$8=\"BIMESTRE\",SUM(AB25:AG26),IF($L$8=\"TRIMESTRE\",SUM(X25:AA26),IF($L$8=\"SEMESTRE\",SUM(T25:U26),IF($L$8=\"AÑO\",SUM(R25:R26))))))","v":0},{"$f":"IF($L$8=\"MES\",SUM(AZ25:BK26),IF($L$8=\"BIMESTRE\",SUM(AH25:AM26),IF($L$8=\"TRIMESTRE\",SUM(AB25:AE26),IF($L$8=\"SEMESTRE\",SUM(V25:W26),IF($L$8=\"AÑO\",SUM(S25:S26))))))","v":0},{"$f":"IF($L$8=\"MES\",SUM(BL25:BW26),IF($L$8=\"BIMESTRE\",SUM(AN25:AS26),IF($L$8=\"TRIMESTRE\",SUM(AF25:AI26),IF($L$8=\"SEMESTRE\",SUM(X25:Y26),IF($L$8=\"AÑO\",SUM(T25:T26))))))","v":0}]
[null,{"$f":"B27","v":"RECUPERACIÓN DE LA COBERTURA VEGETAL DE LOS ECOSISTEMAS ASOCIADOS"},null,null,null,null,{"$f":"IF($L$8=\"MES\",SUM(P27:AA30),IF($L$8=\"BIMESTRE\",SUM(P27:U30),IF($L$8=\"TRIMESTRE\",SUM(P27:S30),IF($L$8=\"SEMESTRE\",SUM(P27:Q30),IF($L$8=\"AÑO\",SUM(P27:P30))))))","v":0},{"$f":"IF($L$8=\"MES\",SUM(AB27:AM30),IF($L$8=\"BIMESTRE\",SUM(V27:AA30),IF($L$8=\"TRIMESTRE\",SUM(T27:W30),IF($L$8=\"SEMESTRE\",SUM(R27:S30),IF($L$8=\"AÑO\",SUM(Q27:Q30))))))","v":0},{"$f":"IF($L$8=\"MES\",SUM(AN27:AY30),IF($L$8=\"BIMESTRE\",SUM(AB27:AG30),IF($L$8=\"TRIMESTRE\",SUM(X27:AA30),IF($L$8=\"SEMESTRE\",SUM(T27:U30),IF($L$8=\"AÑO\",SUM(R27:R30))))))","v":0},{"$f":"IF($L$8=\"MES\",SUM(AZ27:BK30),IF($L$8=\"BIMESTRE\",SUM(AH27:AM30),IF($L$8=\"TRIMESTRE\",SUM(AB27:AE30),IF($L$8=\"SEMESTRE\",SUM(V27:W30),IF($L$8=\"AÑO\",SUM(S27:S30))))))","v":0},{"$f":"IF($L$8=\"MES\",SUM(BL27:BW30),IF($L$8=\"BIMESTRE\",SUM(AN27:AS30),IF($L$8=\"TRIMESTRE\",SUM(AF27:AI30),IF($L$8=\"SEMESTRE\",SUM(X27:Y30),IF($L$8=\"AÑO\",SUM(T27:T30))))))","v":0}]
[null,{"$f":"B31","v":"RECUPERACIÓN DE LAS CARACTERÍSTICAS DEL SUELO DEL ECOSISTEMA ASOCIADO"},null,null,null,null,{"$f":"IF($L$8=\"MES\",SUM(P31:AA32),IF($L$8=\"BIMESTRE\",SUM(P31:U32),IF($L$8=\"TRIMESTRE\",SUM(P31:S32),IF($L$8=\"SEMESTRE\",SUM(P31:Q32),IF($L$8=\"AÑO\",SUM(P31:P32))))))","v":0},{"$f":"IF($L$8=\"MES\",SUM(AB31:AM32),IF($L$8=\"BIMESTRE\",SUM(V31:AA32),IF($L$8=\"TRIMESTRE\",SUM(T31:W32),IF($L$8=\"SEMESTRE\",SUM(R31:S32),IF($L$8=\"AÑO\",SUM(Q31:Q32))))))","v":0},{"$f":"IF($L$8=\"MES\",SUM(AN31:AY32),IF($L$8=\"BIMESTRE\",SUM(AB31:AG32),IF($L$8=\"TRIMESTRE\",SUM(X31:AA32),IF($L$8=\"SEMESTRE\",SUM(T31:U32),IF($L$8=\"AÑO\",SUM(R31:R32))))))","v":0},{"$f":"IF($L$8=\"MES\",SUM(AZ31:BK32),IF($L$8=\"BIMESTRE\",SUM(AH31:AM32),IF($L$8=\"TRIMESTRE\",SUM(AB31:AE32),IF($L$8=\"SEMESTRE\",SUM(V31:W32),IF($L$8=\"AÑO\",SUM(S31:S32))))))","v":0},{"$f":"IF($L$8=\"MES\",SUM(BL31:BW32),IF($L$8=\"BIMESTRE\",SUM(AN31:AS32),IF($L$8=\"TRIMESTRE\",SUM(AF31:AI32),IF($L$8=\"SEMESTRE\",SUM(X31:Y32),IF($L$8=\"AÑO\",SUM(T31:T32))))))","v":0}]
[null,{"$f":"B33","v":"ADAPTACIÓN A LOS REGÍMENES DE PRECIPITACIÓN Y TEMPERATURAS"},null,null,null,null,{"$f":"IF($L$8=\"MES\",SUM(P33:AA38),IF($L$8=\"BIMESTRE\",SUM(P33:U38),IF($L$8=\"TRIMESTRE\",SUM(P33:S38),IF($L$8=\"SEMESTRE\",SUM(P33:Q38),IF($L$8=\"AÑO\",SUM(P33:P38))))))","v":0},{"$f":"IF($L$8=\"MES\",SUM(AB33:AM38),IF($L$8=\"BIMESTRE\",SUM(V33:AA38),IF($L$8=\"TRIMESTRE\",SUM(T33:W38),IF($L$8=\"SEMESTRE\",SUM(R33:S38),IF($L$8=\"AÑO\",SUM(Q33:Q38))))))","v":0},{"$f":"IF($L$8=\"MES\",SUM(AN33:AY38),IF($L$8=\"BIMESTRE\",SUM(AB33:AG38),IF($L$8=\"TRIMESTRE\",SUM(X33:AA38),IF($L$8=\"SEMESTRE\",SUM(T33:U38),IF($L$8=\"AÑO\",SUM(R33:R38))))))","v":0},{"$f":"IF($L$8=\"MES\",SUM(AZ33:BK38),IF($L$8=\"BIMESTRE\",SUM(AH33:AM38),IF($L$8=\"TRIMESTRE\",SUM(AB33:AE38),IF($L$8=\"SEMESTRE\",SUM(V33:W38),IF($L$8=\"AÑO\",SUM(S33:S38))))))","v":0},{"$f":"IF($L$8=\"MES\",SUM(BL33:BW38),IF($L$8=\"BIMESTRE\",SUM(AN33:AS38),IF($L$8=\"TRIMESTRE\",SUM(AF33:AI38),IF($L$8=\"SEMESTRE\",SUM(X33:Y38),IF($L$8=\"AÑO\",SUM(T33:T38))))))","v":0}]
[null,{"$f":"B39","v":"ADECUADAS PRÁCTICAS DEL MANEJO DEL ECOSISTEMA"},null,null,null,null,{"$f":"IF($L$8=\"MES\",SUM(P39:AA44),IF($L$8=\"BIMESTRE\",SUM(P39:U44),IF($L$8=\"TRIMESTRE\",SUM(P39:S44),IF($L$8=\"SEMESTRE\",SUM(P39:Q44),IF($L$8=\"AÑO\",SUM(P39:P44))))))","v":0},{"$f":"IF($L$8=\"MES\",SUM(AB39:AM44),IF($L$8=\"BIMESTRE\",SUM(V39:AA44),IF($L$8=\"TRIMESTRE\",SUM(T39:W44),IF($L$8=\"SEMESTRE\",SUM(R39:S44),IF($L$8=\"AÑO\",SUM(Q39:Q44))))))","v":0},{"$f":"IF($L$8=\"MES\",SUM(AN39:AY44),IF($L$8=\"BIMESTRE\",SUM(AB39:AG44),IF($L$8=\"TRIMESTRE\",SUM(X39:AA44),IF($L$8=\"SEMESTRE\",SUM(T39:U44),IF($L$8=\"AÑO\",SUM(R39:R44))))))","v":0},{"$f":"IF($L$8=\"MES\",SUM(AZ39:BK44),IF($L$8=\"BIMESTRE\",SUM(AH39:AM44),IF($L$8=\"TRIMESTRE\",SUM(AB39:AE44),IF($L$8=\"SEMESTRE\",SUM(V39:W44),IF($L$8=\"AÑO\",SUM(S39:S44))))))","v":0},{"$f":"IF($L$8=\"MES\",SUM(BL39:BW44),IF($L$8=\"BIMESTRE\",SUM(AN39:AS44),IF($L$8=\"TRIMESTRE\",SUM(AF39:AI44),IF($L$8=\"SEMESTRE\",SUM(X39:Y44),IF($L$8=\"AÑO\",SUM(T39:T44))))))","v":0}]
[null,{"$f":"B45","v":"ADECUADAS CAPACIDADES DE LAS ENTIDADES A CARGO DE LA GESTIÓN DEL ECOSISTEMA"},null,null,null,null,{"$f":"IF($L$8=\"MES\",SUM(P45:AA49),IF($L$8=\"BIMESTRE\",SUM(P45:U49),IF($L$8=\"TRIMESTRE\",SUM(P45:S49),IF($L$8=\"SEMESTRE\",SUM(P45:Q49),IF($L$8=\"AÑO\",SUM(P45:P49))))))","v":0},{"$f":"IF($L$8=\"MES\",SUM(AB45:AM49),IF($L$8=\"BIMESTRE\",SUM(V45:AA49),IF($L$8=\"TRIMESTRE\",SUM(T45:W49),IF($L$8=\"SEMESTRE\",SUM(R45:S49),IF($L$8=\"AÑO\",SUM(Q45:Q49))))))","v":0},{"$f":"IF($L$8=\"MES\",SUM(AN45:AY49),IF($L$8=\"BIMESTRE\",SUM(AB45:AG49),IF($L$8=\"TRIMESTRE\",SUM(X45:AA49),IF($L$8=\"SEMESTRE\",SUM(T45:U49),IF($L$8=\"AÑO\",SUM(R45:R49))))))","v":0},{"$f":"IF($L$8=\"MES\",SUM(AZ45:BK49),IF($L$8=\"BIMESTRE\",SUM(AH45:AM49),IF($L$8=\"TRIMESTRE\",SUM(AB45:AE49),IF($L$8=\"SEMESTRE\",SUM(V45:W49),IF($L$8=\"AÑO\",SUM(S45:S49))))))","v":0},{"$f":"IF($L$8=\"MES\",SUM(BL45:BW49),IF($L$8=\"BIMESTRE\",SUM(AN45:AS49),IF($L$8=\"TRIMESTRE\",SUM(AF45:AI49),IF($L$8=\"SEMESTRE\",SUM(X45:Y49),IF($L$8=\"AÑO\",SUM(T45:T49))))))","v":0}]
[null,"OTROS COSTOS",null,null,null,null,"AÑO"]
[null,null,null,null,null,null,"PERIODO"]
[null,null,null,null,null,null,1,2,3,4,5]
[null,{"$f":"B53","v":"GESTIÓN DEL PROYECTO"},null,null,null,null,{"$f":"IF($L$8=\"MES\",SUM(P53:AA53),IF($L$8=\"BIMESTRE\",SUM(P53:U53),IF($L$8=\"TRIMESTRE\",SUM(P53:S53),IF($L$8=\"SEMESTRE\",SUM(P53:Q53),IF($L$8=\"AÑO\",SUM(P53))))))","v":0},{"$f":"IF($L$8=\"MES\",SUM(AB53:AM53),IF($L$8=\"BIMESTRE\",SUM(V53:AA53),IF($L$8=\"TRIMESTRE\",SUM(T53:W53),IF($L$8=\"SEMESTRE\",SUM(R53:S53),IF($L$8=\"AÑO\",SUM(Q53))))))","v":0},{"$f":"IF($L$8=\"MES\",SUM(AN53:AY53),IF($L$8=\"BIMESTRE\",SUM(AB53:AG53),IF($L$8=\"TRIMESTRE\",SUM(X53:AA53),IF($L$8=\"SEMESTRE\",SUM(T53:U53),IF($L$8=\"AÑO\",SUM(R53))))))","v":0},{"$f":"IF($L$8=\"MES\",SUM(AZ53:BK53),IF($L$8=\"BIMESTRE\",SUM(AH53:AM53),IF($L$8=\"TRIMESTRE\",SUM(AB53:AE53),IF($L$8=\"SEMESTRE\",SUM(V53:W53),IF($L$8=\"AÑO\",SUM(S53))))))","v":0},{"$f":"IF($L$8=\"MES\",SUM(BL53:BW53),IF($L$8=\"BIMESTRE\",SUM(AN53:AS53),IF($L$8=\"TRIMESTRE\",SUM(AF53:AI53),IF($L$8=\"SEMESTRE\",SUM(X53:Y53),IF($L$8=\"AÑO\",SUM(T53))))))","v":0}]
[null,{"$f":"B54","v":"EXPEDIENTE TÉCNICO"},null,null,null,null,{"$f":"IF($L$8=\"MES\",SUM(P54:AA54),IF($L$8=\"BIMESTRE\",SUM(P54:U54),IF($L$8=\"TRIMESTRE\",SUM(P54:S54),IF($L$8=\"SEMESTRE\",SUM(P54:Q54),IF($L$8=\"AÑO\",SUM(P54))))))","v":0},{"$f":"IF($L$8=\"MES\",SUM(AB54:AM54),IF($L$8=\"BIMESTRE\",SUM(V54:AA54),IF($L$8=\"TRIMESTRE\",SUM(T54:W54),IF($L$8=\"SEMESTRE\",SUM(R54:S54),IF($L$8=\"AÑO\",SUM(Q54))))))","v":0},{"$f":"IF($L$8=\"MES\",SUM(AN54:AY54),IF($L$8=\"BIMESTRE\",SUM(AB54:AG54),IF($L$8=\"TRIMESTRE\",SUM(X54:AA54),IF($L$8=\"SEMESTRE\",SUM(T54:U54),IF($L$8=\"AÑO\",SUM(R54))))))","v":0},{"$f":"IF($L$8=\"MES\",SUM(AZ54:BK54),IF($L$8=\"BIMESTRE\",SUM(AH54:AM54),IF($L$8=\"TRIMESTRE\",SUM(AB54:AE54),IF($L$8=\"SEMESTRE\",SUM(V54:W54),IF($L$8=\"AÑO\",SUM(S54))))))","v":0},{"$f":"IF($L$8=\"MES\",SUM(BL54:BW54),IF($L$8=\"BIMESTRE\",SUM(AN54:AS54),IF($L$8=\"TRIMESTRE\",SUM(AF54:AI54),IF($L$8=\"SEMESTRE\",SUM(X54:Y54),IF($L$8=\"AÑO\",SUM(T54))))))","v":0}]
[null,{"$f":"B55","v":"SUPERVISIÓN DE EXPEDIENTE TÉCNICO"},null,null,null,null,{"$f":"IF($L$8=\"MES\",SUM(P55:AA55),IF($L$8=\"BIMESTRE\",SUM(P55:U55),IF($L$8=\"TRIMESTRE\",SUM(P55:S55),IF($L$8=\"SEMESTRE\",SUM(P55:Q55),IF($L$8=\"AÑO\",SUM(P55))))))","v":0},{"$f":"IF($L$8=\"MES\",SUM(AB55:AM55),IF($L$8=\"BIMESTRE\",SUM(V55:AA55),IF($L$8=\"TRIMESTRE\",SUM(T55:W55),IF($L$8=\"SEMESTRE\",SUM(R55:S55),IF($L$8=\"AÑO\",SUM(Q55))))))","v":0},{"$f":"IF($L$8=\"MES\",SUM(AN55:AY55),IF($L$8=\"BIMESTRE\",SUM(AB55:AG55),IF($L$8=\"TRIMESTRE\",SUM(X55:AA55),IF($L$8=\"SEMESTRE\",SUM(T55:U55),IF($L$8=\"AÑO\",SUM(R55))))))","v":0},{"$f":"IF($L$8=\"MES\",SUM(AZ55:BK55),IF($L$8=\"BIMESTRE\",SUM(AH55:AM55),IF($L$8=\"TRIMESTRE\",SUM(AB55:AE55),IF($L$8=\"SEMESTRE\",SUM(V55:W55),IF($L$8=\"AÑO\",SUM(S55))))))","v":0},{"$f":"IF($L$8=\"MES\",SUM(BL55:BW55),IF($L$8=\"BIMESTRE\",SUM(AN55:AS55),IF($L$8=\"TRIMESTRE\",SUM(AF55:AI55),IF($L$8=\"SEMESTRE\",SUM(X55:Y55),IF($L$8=\"AÑO\",SUM(T55))))))","v":0}]
[null,{"$f":"B56","v":"SUPERVISIÓN DE EJECUCIÓN FÍSICA DEL PROYECTO Y LIQUIDACIÓN"},null,null,null,null,{"$f":"IF($L$8=\"MES\",SUM(P56:AA56),IF($L$8=\"BIMESTRE\",SUM(P56:U56),IF($L$8=\"TRIMESTRE\",SUM(P56:S56),IF($L$8=\"SEMESTRE\",SUM(P56:Q56),IF($L$8=\"AÑO\",SUM(P56))))))","v":0},{"$f":"IF($L$8=\"MES\",SUM(AB56:AM56),IF($L$8=\"BIMESTRE\",SUM(V56:AA56),IF($L$8=\"TRIMESTRE\",SUM(T56:W56),IF($L$8=\"SEMESTRE\",SUM(R56:S56),IF($L$8=\"AÑO\",SUM(Q56))))))","v":0},{"$f":"IF($L$8=\"MES\",SUM(AN56:AY56),IF($L$8=\"BIMESTRE\",SUM(AB56:AG56),IF($L$8=\"TRIMESTRE\",SUM(X56:AA56),IF($L$8=\"SEMESTRE\",SUM(T56:U56),IF($L$8=\"AÑO\",SUM(R56))))))","v":0},{"$f":"IF($L$8=\"MES\",SUM(AZ56:BK56),IF($L$8=\"BIMESTRE\",SUM(AH56:AM56),IF($L$8=\"TRIMESTRE\",SUM(AB56:AE56),IF($L$8=\"SEMESTRE\",SUM(V56:W56),IF($L$8=\"AÑO\",SUM(S56))))))","v":0},{"$f":"IF($L$8=\"MES\",SUM(BL56:BW56),IF($L$8=\"BIMESTRE\",SUM(AN56:AS56),IF($L$8=\"TRIMESTRE\",SUM(AF56:AI56),IF($L$8=\"SEMESTRE\",SUM(X56:Y56),IF($L$8=\"AÑO\",SUM(T56))))))","v":0}]
[null,{"$f":"B57","v":"INVERSIÓN TOTAL"},null,null,null,null,{"$f":"SUM(G64:G70)+SUM(G74:G77)","v":0},{"$f":"SUM(H64:H70)+SUM(H74:H77)","v":0},{"$f":"SUM(I64:I70)+SUM(I74:I77)","v":0},{"$f":"SUM(J64:J70)+SUM(J74:J77)","v":0},{"$f":"SUM(K64:K70)+SUM(K74:K77)","v":0}]
[]
[]
[null,null,null,null,"LA META FÍSICA SE DESARROLLA EN EL MISMO PERIODO QUE LA EJECUCIÓN FINANCIERA"]
[]
[]
[null,"META FÍSICA POR COMPONENTE"]
[null,"COMPONENTE",null,null,null,null,"ACCION",null,null,"UNIDAD REPRESENTATIVA",null,"FECHA DE INICIO",null,"FECHA DE TÉRMINO",null,{"$f":"P19","v":"MES"},null,null,null,null,null,null,null,null,null,null,null,null,null,null,null,null,null,null,null,null,null,null,null,null,null,null,null,null,null,null,null,null,null,null,null,null,null,null,null,null,null,null,null,null,null,null,null,null,null,null,null,null,null,null,null,null,null,null,null,null,"META TOTAL"]
[null,null,null,null,null,null,null,null,null,null,null,null,null,null,null,"PERIODO"]
[null,null,null,null,null,null,null,null,null,null,null,null,null,null,null,1,2,3,4,5,6,7,8,9,10,11,12,13,14,15,16,17,18,19,20,21,22,23,24,25,26,27,28,29,30,31,32,33,34,35,36,37,38,39,40,41,42,43,44,45,46,47,48,49,50,51,52,53,54,55,56,57,58,59,60,"N"]
[null,{"$f":"B22","v":"RECUPERACIÓN DE LA COBERTURA VEGETAL NATIVA DEL ECOSISTEMA PRINCIPAL"},null,null,null,null,{"$f":"CRONOGRAMA!G22","v":"REVEGETACIÓN CON ESPECIES NATIVAS"},null,null,{"$f":"'COSTOS UNITARIOS'!R12","v":"HA"},null,{"$f":"+'8.ANALISIS TÉCNICO'!U107","v":"00:00:00"},null,{"$f":"+'8.ANALISIS TÉCNICO'!W107","v":"00:00:00"},null,null,null,null,null,null,null,null,null,null,null,null,null,null,null,null,null,null,null,null,null,null,null,null,null,null,null,null,null,null,null,null,null,null,null,null,null,null,null,null,null,null,null,null,null,null,null,null,null,null,null,null,null,null,null,null,null,null,null,null,null,null,{"$f":"SUM(P88:BX88)","v":0}]
[null,null,null,null,null,null,{"$f":"CRONOGRAMA!G23","v":"INSTALACIÓN DE CERCOS EXCLUIDORES"},null,null,{"$f":"'COSTOS UNITARIOS'!R15","v":"ML"},null,{"$f":"+'8.ANALISIS TÉCNICO'!U108","v":"00:00:00"},null,{"$f":"+'8.ANALISIS TÉCNICO'!W108","v":"00:00:00"},null,null,null,null,null,null,null,null,null,null,null,null,null,null,null,null,null,null,null,null,null,null,null,null,null,null,null,null,null,null,null,null,null,null,null,null,null,null,null,null,null,null,null,null,null,null,null,null,null,null,null,null,null,null,null,null,null,null,null,null,null,null,{"$f":"SUM(P89:BX89)","v":0}]
[null,null,null,null,null,null,{"$f":"CRONOGRAMA!G24","v":"OTRO:"},null,null,{"$f":"'COSTOS UNITARIOS'!R19","v":0},null,{"$f":"+'8.ANALISIS TÉCNICO'!U109","v":"00:00:00"},null,{"$f":"+'8.ANALISIS TÉCNICO'!W109","v":"00:00:00"},null,null,null,null,null,null,null,null,null,null,null,null,null,null,null,null,null,null,null,null,null,null,null,null,null,null,null,null,null,null,null,null,null,null,null,null,null,null,null,null,null,null,null,null,null,null,null,null,null,null,null,null,null,null,null,null,null,null,null,null,null,null,0]
[null,{"$f":"B25","v":"RECUPERACIÓN DE LAS CARACTERÍSTICAS DE LA TURBA DEL ECOSISTEMA PRINCIPAL"},null,null,null,null,{"$f":"CRONOGRAMA!G25","v":"REVEGETACIÓN CON ESPECIES NATIVAS"},null,null,{"$f":"'COSTOS UNITARIOS'!R22","v":"HA"},null,{"$f":"+'8.ANALISIS TÉCNICO'!U111","v":"00:00:00"},null,{"$f":"+'8.ANALISIS TÉCNICO'!W111","v":"00:00:00"},null,null,null,null,null,null,null,null,null,null,null,null,null,null,null,null,null,null,null,null,null,null,null,null,null,null,null,null,null,null,null,null,null,null,null,null,null,null,null,null,null,null,null,null,null,null,null,null,null,null,null,null,null,null,null,null,null,null,null,null,null,null,0]
[null,null,null,null,null,null,{"$f":"CRONOGRAMA!G26","v":"OTRO:"},null,null,{"$f":"'COSTOS UNITARIOS'!R25","v":0},null,{"$f":"+'8.ANALISIS TÉCNICO'!U112","v":"00:00:00"},null,{"$f":"+'8.ANALISIS TÉCNICO'!W112","v":"00:00:00"},null,null,null,null,null,null,null,null,null,null,null,null,null,null,null,null,null,null,null,null,null,null,null,null,null,null,null,null,null,null,null,null,null,null,null,null,null,null,null,null,null,null,null,null,null,null,null,null,null,null,null,null,null,null,null,null,null,null,null,null,null,null,0]
[null,{"$f":"B27","v":"RECUPERACIÓN DE LA COBERTURA VEGETAL DE LOS ECOSISTEMAS ASOCIADOS"},null,null,null,null,{"$f":"CRONOGRAMA!G27","v":"REFORESTACIÓN CON ESPECIES NATIVAS"},null,null,{"$f":"'COSTOS UNITARIOS'!R28","v":"HA"},null,{"$f":"+'8.ANALISIS TÉCNICO'!U114","v":"00:00:00"},null,{"$f":"+'8.ANALISIS TÉCNICO'!W114","v":"00:00:00"},null,null,null,null,null,null,null,null,null,null,null,null,null,null,null,null,null,null,null,null,null,null,null,null,null,null,null,null,null,null,null,null,null,null,null,null,null,null,null,null,null,null,null,null,null,null,null,null,null,null,null,null,null,null,null,null,null,null,null,null,null,null,0]
[null,null,null,null,null,null,{"$f":"CRONOGRAMA!G28","v":"REVEGETACIÓN CON ESPECIES NATIVAS"},null,null,{"$f":"'COSTOS UNITARIOS'!R34","v":"HA"},null,{"$f":"+'8.ANALISIS TÉCNICO'!U115","v":"00:00:00"},null,{"$f":"+'8.ANALISIS TÉCNICO'!W115","v":"00:00:00"},null,null,null,null,null,null,null,null,null,null,null,null,null,null,null,null,null,null,null,null,null,null,null,null,null,null,null,null,null,null,null,null,null,null,null,null,null,null,null,null,null,null,null,null,null,null,null,null,null,null,null,null,null,null,null,null,null,null,null,null,null,null,0]
[null,null,null,null,null,null,{"$f":"CRONOGRAMA!G29","v":"INSTALACIÓN DE CERCOS EXCLUIDORES"},null,null,{"$f":"'COSTOS UNITARIOS'!R37","v":"ML"},null,{"$f":"+'8.ANALISIS TÉCNICO'!U116","v":"00:00:00"},null,{"$f":"+'8.ANALISIS TÉCNICO'!W116","v":"00:00:00"},null,null,null,null,null,null,null,null,null,null,null,null,null,null,null,null,null,null,null,null,null,null,null,null,null,null,null,null,null,null,null,null,null,null,null,null,null,null,null,null,null,null,null,null,null,null,null,null,null,null,null,null,null,null,null,null,null,null,null,null,null,null,0]
[null,null,null,null,null,null,{"$f":"CRONOGRAMA!G30","v":"OTRO:"},null,null,{"$f":"'COSTOS UNITARIOS'!R41","v":0},null,{"$f":"+'8.ANALISIS TÉCNICO'!U117","v":"00:00:00"},null,{"$f":"+'8.ANALISIS TÉCNICO'!W117","v":"00:00:00"},null,null,null,null,null,null,null,null,null,null,null,null,null,null,null,null,null,null,null,null,null,null,null,null,null,null,null,null,null,null,null,null,null,null,null,null,null,null,null,null,null,null,null,null,null,null,null,null,null,null,null,null,null,null,null,null,null,null,null,null,null,null,0]
[null,{"$f":"B31","v":"RECUPERACIÓN DE LAS CARACTERÍSTICAS DEL SUELO DEL ECOSISTEMA ASOCIADO"},null,null,null,null,{"$f":"CRONOGRAMA!G31","v":"ENRIQUECIMIENTO DE SUELOS"},null,null,{"$f":"'COSTOS UNITARIOS'!R44","v":"HA"},null,{"$f":"+'8.ANALISIS TÉCNICO'!U119","v":"00:00:00"},null,{"$f":"+'8.ANALISIS TÉCNICO'!W119","v":"00:00:00"},null,null,null,null,null,null,null,null,null,null,null,null,null,null,null,null,null,null,null,null,null,null,null,null,null,null,null,null,null,null,null,null,null,null,null,null,null,null,null,null,null,null,null,null,null,null,null,null,null,null,null,null,null,null,null,null,null,null,null,null,null,null,0]
[null,null,null,null,null,null,{"$f":"CRONOGRAMA!G32","v":"OTRO:"},null,null,{"$f":"'COSTOS UNITARIOS'!R49","v":0},null,{"$f":"+'8.ANALISIS TÉCNICO'!U120","v":"00:00:00"},null,{"$f":"+'8.ANALISIS TÉCNICO'!W120","v":"00:00:00"},null,null,null,null,null,null,null,null,null,null,null,null,null,null,null,null,null,null,null,null,null,null,null,null,null,null,null,null,null,null,null,null,null,null,null,null,null,null,null,null,null,null,null,null,null,null,null,null,null,null,null,null,null,null,null,null,null,null,null,null,null,null,0]
[null,{"$f":"B33","v":"ADAPTACIÓN A LOS REGÍMENES DE PRECIPITACIÓN Y TEMPERATURAS"},null,null,null,null,{"$f":"CRONOGRAMA!G33","v":"REPARACIÓN DEL CANAL AMUNADOR"},null,null,{"$f":"'COSTOS UNITARIOS'!R52","v":"HA"},null,{"$f":"+'8.ANALISIS TÉCNICO'!U122","v":"00:00:00"},null,{"$f":"+'8.ANALISIS TÉCNICO'!W122","v":"00:00:00"},null,null,null,null,null,null,null,null,null,null,null,null,null,null,null,null,null,null,null,null,null,null,null,null,null,null,null,null,null,null,null,null,null,null,null,null,null,null,null,null,null,null,null,null,null,null,null,null,null,null,null,null,null,null,null,null,null,null,null,null,null,null,0]
[null,null,null,null,null,null,{"$f":"CRONOGRAMA!G34","v":"REPARACIÓN DEL CANAL DE MAMANTEO"},null,null,{"$f":"'COSTOS UNITARIOS'!R56","v":"ML"},null,{"$f":"+'8.ANALISIS TÉCNICO'!U123","v":"00:00:00"},null,{"$f":"+'8.ANALISIS TÉCNICO'!W123","v":"00:00:00"},null,null,null,null,null,null,null,null,null,null,null,null,null,null,null,null,null,null,null,null,null,null,null,null,null,null,null,null,null,null,null,null,null,null,null,null,null,null,null,null,null,null,null,null,null,null,null,null,null,null,null,null,null,null,null,null,null,null,null,null,null,null,0]
[null,null,null,null,null,null,{"$f":"CRONOGRAMA!G35","v":"CONSTRUCCIÓN DE ZANJAS DE INFILTRACIÓN"},null,null,{"$f":"'COSTOS UNITARIOS'!R60","v":"ML"},null,{"$f":"+'8.ANALISIS TÉCNICO'!U124","v":"00:00:00"},null,{"$f":"+'8.ANALISIS TÉCNICO'!W124","v":"00:00:00"},null,null,null,null,null,null,null,null,null,null,null,null,null,null,null,null,null,null,null,null,null,null,null,null,null,null,null,null,null,null,null,null,null,null,null,null,null,null,null,null,null,null,null,null,null,null,null,null,null,null,null,null,null,null,null,null,null,null,null,null,null,null,0]
[null,null,null,null,null,null,{"$f":"CRONOGRAMA!G36","v":"INSTALACIÓN DE QOCHAS"},null,null,{"$f":"'COSTOS UNITARIOS'!R64","v":"UNIDAD"},null,{"$f":"+'8.ANALISIS TÉCNICO'!U125","v":"00:00:00"},null,{"$f":"+'8.ANALISIS TÉCNICO'!W125","v":"00:00:00"},null,null,null,null,null,null,null,null,null,null,null,null,null,null,null,null,null,null,null,null,null,null,null,null,null,null,null,null,null,null,null,null,null,null,null,null,null,null,null,null,null,null,null,null,null,null,null,null,null,null,null,null,null,null,null,null,null,null,null,null,null,null,0]
[null,null,null,null,null,null,{"$f":"CRONOGRAMA!G37","v":"CONSTRUCCIÓN DE TERRAZAS DE FORMACIÓN DE SUELOS"},null,null,{"$f":"'COSTOS UNITARIOS'!R66","v":"HA"},null,{"$f":"+'8.ANALISIS TÉCNICO'!U126","v":"00:00:00"},null,{"$f":"+'8.ANALISIS TÉCNICO'!W126","v":"00:00:00"},null,null,null,null,null,null,null,null,null,null,null,null,null,null,null,null,null,null,null,null,null,null,null,null,null,null,null,null,null,null,null,null,null,null,null,null,null,null,null,null,null,null,null,null,null,null,null,null,null,null,null,null,null,null,null,null,null,null,null,null,null,null,{"$f":"SUM(P103:BX103)","v":0}]
[null,null,null,null,null,null,{"$f":"CRONOGRAMA!G38","v":"OTRO:"},null,null,{"$f":"'COSTOS UNITARIOS'!R71","v":0},null,{"$f":"+'8.ANALISIS TÉCNICO'!U127","v":"00:00:00"},null,{"$f":"+'8.ANALISIS TÉCNICO'!W127","v":"00:00:00"},null,null,null,null,null,null,null,null,null,null,null,null,null,null,null,null,null,null,null,null,null,null,null,null,null,null,null,null,null,null,null,null,null,null,null,null,null,null,null,null,null,null,null,null,null,null,null,null,null,null,null,null,null,null,null,null,null,null,null,null,null,null,{"$f":"SUM(P104:BX104)","v":0}]
[null,{"$f":"B39","v":"ADECUADAS PRÁCTICAS DEL MANEJO DEL ECOSISTEMA"},null,null,null,null,{"$f":"CRONOGRAMA!G39","v":"CAPACITACIÓN EN GESTIÓN INTEGRADA DE RECURSOS HÍDRICOS CON ENFOQUE DE CUENCA"},null,null,{"$f":"'COSTOS UNITARIOS'!R74","v":"EVENTO"},null,{"$f":"+'8.ANALISIS TÉCNICO'!U129","v":"00:00:00"},null,{"$f":"+'8.ANALISIS TÉCNICO'!W129","v":"00:00:00"},null,null,null,null,null,null,null,null,null,null,null,null,null,null,null,null,null,null,null,null,null,null,null,null,null,null,null,null,null,null,null,null,null,null,null,null,null,null,null,null,null,null,null,null,null,null,null,null,null,null,null,null,null,null,null,null,null,null,null,null,null,null,{"$f":"SUM(P105:BX105)","v":0}]
[null,null,null,null,null,null,{"$f":"CRONOGRAMA!G40","v":"ASISTENCIA TÉCNICA EN EL MANEJO DE ECOSISTEMAS DE INTERÉS HÍDRICO"},null,null,{"$f":"'COSTOS UNITARIOS'!R77","v":"EVENTO"},null,{"$f":"+'8.ANALISIS TÉCNICO'!U130","v":"00:00:00"},null,{"$f":"+'8.ANALISIS TÉCNICO'!W130","v":"00:00:00"},null,null,null,null,null,null,null,null,null,null,null,null,null,null,null,null,null,null,null,null,null,null,null,null,null,null,null,null,null,null,null,null,null,null,null,null,null,null,null,null,null,null,null,null,null,null,null,null,null,null,null,null,null,null,null,null,null,null,null,null,null,null,0]
[null,null,null,null,null,null,{"$f":"CRONOGRAMA!G41","v":"CAPACITACIÓN EN BUENAS PRÁCTICAS PARA LA ADAPTACIÓN AL CAMBIO CLIMÁTICO Y GESTIÓN DE RIESGOS"},null,null,{"$f":"'COSTOS UNITARIOS'!R80","v":"TALLER"},null,{"$f":"+'8.ANALISIS TÉCNICO'!U131","v":"00:00:00"},null,{"$f":"+'8.ANALISIS TÉCNICO'!W131","v":"00:00:00"},null,null,null,null,null,null,null,null,null,null,null,null,null,null,null,null,null,null,null,null,null,null,null,null,null,null,null,null,null,null,null,null,null,null,null,null,null,null,null,null,null,null,null,null,null,null,null,null,null,null,null,null,null,null,null,null,null,null,null,null,null,null,0]
[null,null,null,null,null,null,{"$f":"CRONOGRAMA!G42","v":"SENSIBILIZACIÓN RELACIONADA A LA RECUPERACIÓN DEL SERVICIO ECOSISTÉMICO DE REGULACIÓN HÍDRICA"},null,null,{"$f":"'COSTOS UNITARIOS'!R82","v":"TALLER"},null,{"$f":"+'8.ANALISIS TÉCNICO'!U132","v":"00:00:00"},null,{"$f":"+'8.ANALISIS TÉCNICO'!W132","v":"00:00:00"},null,null,null,null,null,null,null,null,null,null,null,null,null,null,null,null,null,null,null,null,null,null,null,null,null,null,null,null,null,null,null,null,null,null,null,null,null,null,null,null,null,null,null,null,null,null,null,null,null,null,null,null,null,null,null,null,null,null,null,null,null,null,0]
[null,null,null,null,null,null,{"$f":"CRONOGRAMA!G43","v":"INTERCAMBIO DE EXPERIENCIAS RELACIONADA A LA RECUPERACIÓN DEL SERVICIO ECOSISTÉMICO DE REGULACIÓN HÍDRICA"},null,null,{"$f":"'COSTOS UNITARIOS'!R84","v":"EVENTO"},null,{"$f":"+'8.ANALISIS TÉCNICO'!U133","v":"00:00:00"},null,{"$f":"+'8.ANALISIS TÉCNICO'!W133","v":"00:00:00"},null,null,null,null,null,null,null,null,null,null,null,null,null,null,null,null,null,null,null,null,null,null,null,null,null,null,null,null,null,null,null,null,null,null,null,null,null,null,null,null,null,null,null,null,null,null,null,null,null,null,null,null,null,null,null,null,null,null,null,null,null,null,0]
[null,null,null,null,null,null,{"$f":"CRONOGRAMA!G44","v":"OTRO:"},null,null,{"$f":"'COSTOS UNITARIOS'!R86","v":0},null,{"$f":"+'8.ANALISIS TÉCNICO'!U134","v":"00:00:00"},null,{"$f":"+'8.ANALISIS TÉCNICO'!W134","v":"00:00:00"},null,null,null,null,null,null,null,null,null,null,null,null,null,null,null,null,null,null,null,null,null,null,null,null,null,null,null,null,null,null,null,null,null,null,null,null,null,null,null,null,null,null,null,null,null,null,null,null,null,null,null,null,null,null,null,null,null,null,null,null,null,null,0]
[null,{"$f":"B45","v":"ADECUADAS CAPACIDADES DE LAS ENTIDADES A CARGO DE LA GESTIÓN DEL ECOSISTEMA"},null,null,null,null,{"$f":"CRONOGRAMA!G45","v":"CAPACITACIÓN A FUNCIONARIOS PÚBLICOS SOBRE LA GESTIÓN INTEGRADA DEL RECURSO HÍDRICO CON ENFOQUE DE CUENCA"},null,null,{"$f":"'COSTOS UNITARIOS'!R89","v":"TALLER"},null,{"$f":"+'8.ANALISIS TÉCNICO'!U136","v":"00:00:00"},null,{"$f":"+'8.ANALISIS TÉCNICO'!W136","v":"00:00:00"},null,null,null,null,null,null,null,null,null,null,null,null,null,null,null,null,null,null,null,null,null,null,null,null,null,null,null,null,null,null,null,null,null,null,null,null,null,null,null,null,null,null,null,null,null,null,null,null,null,null,null,null,null,null,null,null,null,null,null,null,null,null,0]
[null,null,null,null,null,null,{"$f":"CRONOGRAMA!G46","v":"CAPACITACIÓN A FUNCIONARIOS PÚBLICOS SOBRE LAS MEDIDAS DE ADAPTACIÓN EN UN CONTEXTO DE CAMBIO CLIMÁTICO EN LA GESTIÓN INTEGRADA DE LOS RECURSOS HÍDRICOS"},null,null,{"$f":"'COSTOS UNITARIOS'!R91","v":"TALLER"},null,{"$f":"+'8.ANALISIS TÉCNICO'!U137","v":"00:00:00"},null,{"$f":"+'8.ANALISIS TÉCNICO'!W137","v":"00:00:00"},null,null,null,null,null,null,null,null,null,null,null,null,null,null,null,null,null,null,null,null,null,null,null,null,null,null,null,null,null,null,null,null,null,null,null,null,null,null,null,null,null,null,null,null,null,null,null,null,null,null,null,null,null,null,null,null,null,null,null,null,null,null,0]
[null,null,null,null,null,null,{"$f":"CRONOGRAMA!G47","v":"DESARROLLO DE CAPACIDADES PARA EL MONITOREO Y SEGUIMIENTO DE LOS ECOSISTEMAS DE INTERÉS HÍDRICO Y EL SERVICIO ECOSISTÉMICO DE REGULACIÓN HÍDRICA"},null,null,{"$f":"'COSTOS UNITARIOS'!R93","v":"TALLER"},null,{"$f":"+'8.ANALISIS TÉCNICO'!U138","v":"00:00:00"},null,{"$f":"+'8.ANALISIS TÉCNICO'!W138","v":"00:00:00"},null,null,null,null,null,null,null,null,null,null,null,null,null,null,null,null,null,null,null,null,null,null,null,null,null,null,null,null,null,null,null,null,null,null,null,null,null,null,null,null,null,null,null,null,null,null,null,null,null,null,null,null,null,null,null,null,null,null,null,null,null,null,0]
[null,null,null,null,null,null,{"$f":"CRONOGRAMA!G48","v":"INTERCAMBIO DE EXPERIENCIAS SOBRE LA GESTIÓN INTEGRADA DEL RECURSO HÍDRICO CON ENFOQUE DE CUENCA"},null,null,{"$f":"'COSTOS UNITARIOS'!R95","v":"EVENTO"},null,{"$f":"+'8.ANALISIS TÉCNICO'!U139","v":"00:00:00"},null,{"$f":"+'8.ANALISIS TÉCNICO'!W139","v":"00:00:00"},null,null,null,null,null,null,null,null,null,null,null,null,null,null,null,null,null,null,null,null,null,null,null,null,null,null,null,null,null,null,null,null,null,null,null,null,null,null,null,null,null,null,null,null,null,null,null,null,null,null,null,null,null,null,null,null,null,null,null,null,null,null,0]
[null,null,null,null,null,null,{"$f":"CRONOGRAMA!G49","v":"OTRO:"},null,null,{"$f":"'COSTOS UNITARIOS'!R97","v":0},null,{"$f":"+'8.ANALISIS TÉCNICO'!U140","v":"00:00:00"},null,{"$f":"+'8.ANALISIS TÉCNICO'!W140","v":"00:00:00"},null,null,null,null,null,null,null,null,null,null,null,null,null,null,null,null,null,null,null,null,null,null,null,null,null,null,null,null,null,null,null,null,null,null,null,null,null,null,null,null,null,null,null,null,null,null,null,null,null,null,null,null,null,null,null,null,null,null,null,null,null,null,0]
[null,"OTROS COSTOS",null,null,null,null,null,null,null,"UNIDAD REPRESENTATIVA",null,"FECHA DE INICIO",null,"FECHA DE TÉRMINO",null,{"$f":"P50","v":0},null,null,null,null,null,null,null,null,null,null,null,null,null,null,null,null,null,null,null,null,null,null,null,null,null,null,null,null,null,null,null,null,null,null,null,null,null,null,null,null,null,null,null,null,null,null,null,null,null,null,null,null,null,null,null,null,null,null,null,null,"META TOTAL"]
[null,null,null,null,null,null,null,null,null,null,null,null,null,null,null,"PERIODO"]
[null,null,null,null,null,null,null,null,null,null,null,null,null,null,null,1,2,3,4,5,6,7,8,9,10,11,12,13,14,15,16,17,18,19,20,21,22,23,24,25,26,27,28,29,30,31,32,33,34,35,36,37,38,39,40,41,42,43,44,45,46,47,48,49,50,51,52,53,54,55,56,57,58,59,60,"N"]
[null,"GESTIÓN DEL PROYECTO",null,null,null,null,null,null,null,"GLOBAL",null,null,null,null,null,null,null,null,null,null,null,null,null,null,null,null,null,null,null,null,null,null,null,null,null,null,null,null,null,null,null,null,null,null,null,null,null,null,null,null,null,null,null,null,null,null,null,null,null,null,null,null,null,null,null,null,null,null,null,null,null,null,null,null,null,null,{"$f":"SUM(P119:BX119)","v":0}]
[null,"EXPEDIENTE TÉCNICO",null,null,null,null,null,null,null,"GLOBAL",null,null,null,null,null,null,null,null,null,null,null,null,null,null,null,null,null,null,null,null,null,null,null,null,null,null,null,null,null,null,null,null,null,null,null,null,null,null,null,null,null,null,null,null,null,null,null,null,null,null,null,null,null,null,null,null,null,null,null,null,null,null,null,null,null,null,0]
[null,"SUPERVISIÓN DE EXPEDIENTE TÉCNICO",null,null,null,null,null,null,null,"GLOBAL",null,null,null,null,null,null,null,null,null,null,null,null,null,null,null,null,null,null,null,null,null,null,null,null,null,null,null,null,null,null,null,null,null,null,null,null,null,null,null,null,null,null,null,null,null,null,null,null,null,null,null,null,null,null,null,null,null,null,null,null,null,null,null,null,null,null,0]
[null,"SUPERVISIÓN DE EJECUCIÓN FÍSICA DEL PROYECTO Y LIQUIDACIÓN",null,null,null,null,null,null,null,"GLOBAL",null,null,null,null,null,null,null,null,null,null,null,null,null,null,null,null,null,null,null,null,null,null,null,null,null,null,null,null,null,null,null,null,null,null,null,null,null,null,null,null,null,null,null,null,null,null,null,null,null,null,null,null,null,null,null,null,null,null,null,null,null,null,null,null,null,null,0]
[]
[]
[null,"COMPONENTE",null,null,null,null,"AÑO",null,null,null,null,"META TOTAL"]
[null,null,null,null,null,null,"PERIODO"]
[null,null,null,null,null,null,1,2,3,4,5]
[null,{"$f":"B88","v":"RECUPERACIÓN DE LA COBERTURA VEGETAL NATIVA DEL ECOSISTEMA PRINCIPAL"},null,null,null,null,{"$f":"IF($L$8=\"MES\",SUM(P88:AA90),IF($L$8=\"BIMESTRE\",SUM(P88:U90),IF($L$8=\"TRIMESTRE\",SUM(P88:S90),IF($L$8=\"SEMESTRE\",SUM(P88:Q90),IF($L$8=\"AÑO\",SUM(P88:P90))))))","v":0},{"$f":"IF($L$8=\"MES\",SUM(AB88:AM90),IF($L$8=\"BIMESTRE\",SUM(V88:AA90),IF($L$8=\"TRIMESTRE\",SUM(T88:W90),IF($L$8=\"SEMESTRE\",SUM(R88:S90),IF($L$8=\"AÑO\",SUM(Q88:Q90))))))","v":0},{"$f":"IF($L$8=\"MES\",SUM(AN88:AY90),IF($L$8=\"BIMESTRE\",SUM(AB88:AG90),IF($L$8=\"TRIMESTRE\",SUM(X88:AA90),IF($L$8=\"SEMESTRE\",SUM(T88:U90),IF($L$8=\"AÑO\",SUM(R88:R90))))))","v":0},{"$f":"IF($L$8=\"MES\",SUM(AZ88:BK90),IF($L$8=\"BIMESTRE\",SUM(AH88:AM90),IF($L$8=\"TRIMESTRE\",SUM(AB88:AE90),IF($L$8=\"SEMESTRE\",SUM(V88:W90),IF($L$8=\"AÑO\",SUM(S88:S90))))))","v":0},{"$f":"IF($L$8=\"MES\",SUM(BL88:BW90),IF($L$8=\"BIMESTRE\",SUM(AN88:AS90),IF($L$8=\"TRIMESTRE\",SUM(AF88:AI90),IF($L$8=\"SEMESTRE\",SUM(X88:Y90),IF($L$8=\"AÑO\",SUM(T88:T90))))))","v":0},{"$f":"SUM(G128:K128)","v":0}]
[null,{"$f":"B91","v":"RECUPERACIÓN DE LAS CARACTERÍSTICAS DE LA TURBA DEL ECOSISTEMA PRINCIPAL"},null,null,null,null,{"$f":"IF($L$8=\"MES\",SUM(P91:AA92),IF($L$8=\"BIMESTRE\",SUM(P91:U92),IF($L$8=\"TRIMESTRE\",SUM(P91:S92),IF($L$8=\"SEMESTRE\",SUM(P91:Q92),IF($L$8=\"AÑO\",SUM(P91:P92))))))","v":0},{"$f":"IF($L$8=\"MES\",SUM(AB91:AM92),IF($L$8=\"BIMESTRE\",SUM(V91:AA92),IF($L$8=\"TRIMESTRE\",SUM(T91:W92),IF($L$8=\"SEMESTRE\",SUM(R91:S92),IF($L$8=\"AÑO\",SUM(Q91:Q92))))))","v":0},{"$f":"IF($L$8=\"MES\",SUM(AN91:AY92),IF($L$8=\"BIMESTRE\",SUM(AB91:AG92),IF($L$8=\"TRIMESTRE\",SUM(X91:AA92),IF($L$8=\"SEMESTRE\",SUM(T91:U92),IF($L$8=\"AÑO\",SUM(R91:R92))))))","v":0},{"$f":"IF($L$8=\"MES\",SUM(AZ91:BK92),IF($L$8=\"BIMESTRE\",SUM(AH91:AM92),IF($L$8=\"TRIMESTRE\",SUM(AB91:AE92),IF($L$8=\"SEMESTRE\",SUM(V91:W92),IF($L$8=\"AÑO\",SUM(S91:S92))))))","v":0},{"$f":"IF($L$8=\"MES\",SUM(BL91:BW92),IF($L$8=\"BIMESTRE\",SUM(AN91:AS92),IF($L$8=\"TRIMESTRE\",SUM(AF91:AI92),IF($L$8=\"SEMESTRE\",SUM(X91:Y92),IF($L$8=\"AÑO\",SUM(T91:T92))))))","v":0},{"$f":"SUM(G129:K129)","v":0}]
[null,{"$f":"B93","v":"RECUPERACIÓN DE LA COBERTURA VEGETAL DE LOS ECOSISTEMAS ASOCIADOS"},null,null,null,null,{"$f":"IF($L$8=\"MES\",SUM(P93:AA96),IF($L$8=\"BIMESTRE\",SUM(P93:U96),IF($L$8=\"TRIMESTRE\",SUM(P93:S96),IF($L$8=\"SEMESTRE\",SUM(P93:Q96),IF($L$8=\"AÑO\",SUM(P93:P96))))))","v":0},{"$f":"IF($L$8=\"MES\",SUM(AB93:AM96),IF($L$8=\"BIMESTRE\",SUM(V93:AA96),IF($L$8=\"TRIMESTRE\",SUM(T93:W96),IF($L$8=\"SEMESTRE\",SUM(R93:S96),IF($L$8=\"AÑO\",SUM(Q93:Q96))))))","v":0},{"$f":"IF($L$8=\"MES\",SUM(AN93:AY96),IF($L$8=\"BIMESTRE\",SUM(AB93:AG96),IF($L$8=\"TRIMESTRE\",SUM(X93:AA96),IF($L$8=\"SEMESTRE\",SUM(T93:U96),IF($L$8=\"AÑO\",SUM(R93:R96))))))","v":0},{"$f":"IF($L$8=\"MES\",SUM(AZ93:BK96),IF($L$8=\"BIMESTRE\",SUM(AH93:AM96),IF($L$8=\"TRIMESTRE\",SUM(AB93:AE96),IF($L$8=\"SEMESTRE\",SUM(V93:W96),IF($L$8=\"AÑO\",SUM(S93:S96))))))","v":0},{"$f":"IF($L$8=\"MES\",SUM(BL93:BW96),IF($L$8=\"BIMESTRE\",SUM(AN93:AS96),IF($L$8=\"TRIMESTRE\",SUM(AF93:AI96),IF($L$8=\"SEMESTRE\",SUM(X93:Y96),IF($L$8=\"AÑO\",SUM(T93:T96))))))","v":0},0]
[null,{"$f":"B97","v":"RECUPERACIÓN DE LAS CARACTERÍSTICAS DEL SUELO DEL ECOSISTEMA ASOCIADO"},null,null,null,null,{"$f":"IF($L$8=\"MES\",SUM(P97:AA98),IF($L$8=\"BIMESTRE\",SUM(P97:U98),IF($L$8=\"TRIMESTRE\",SUM(P97:S98),IF($L$8=\"SEMESTRE\",SUM(P97:Q98),IF($L$8=\"AÑO\",SUM(P97:P98))))))","v":0},{"$f":"IF($L$8=\"MES\",SUM(AB97:AM98),IF($L$8=\"BIMESTRE\",SUM(V97:AA98),IF($L$8=\"TRIMESTRE\",SUM(T97:W98),IF($L$8=\"SEMESTRE\",SUM(R97:S98),IF($L$8=\"AÑO\",SUM(Q97:Q98))))))","v":0},{"$f":"IF($L$8=\"MES\",SUM(AN97:AY98),IF($L$8=\"BIMESTRE\",SUM(AB97:AG98),IF($L$8=\"TRIMESTRE\",SUM(X97:AA98),IF($L$8=\"SEMESTRE\",SUM(T97:U98),IF($L$8=\"AÑO\",SUM(R97:R98))))))","v":0},{"$f":"IF($L$8=\"MES\",SUM(AZ97:BK98),IF($L$8=\"BIMESTRE\",SUM(AH97:AM98),IF($L$8=\"TRIMESTRE\",SUM(AB97:AE98),IF($L$8=\"SEMESTRE\",SUM(V97:W98),IF($L$8=\"AÑO\",SUM(S97:S98))))))","v":0},{"$f":"IF($L$8=\"MES\",SUM(BL97:BW98),IF($L$8=\"BIMESTRE\",SUM(AN97:AS98),IF($L$8=\"TRIMESTRE\",SUM(AF97:AI98),IF($L$8=\"SEMESTRE\",SUM(X97:Y98),IF($L$8=\"AÑO\",SUM(T97:T98))))))","v":0},0]
[null,{"$f":"B99","v":"ADAPTACIÓN A LOS REGÍMENES DE PRECIPITACIÓN Y TEMPERATURAS"},null,null,null,null,{"$f":"IF($L$8=\"MES\",SUM(P99:AA104),IF($L$8=\"BIMESTRE\",SUM(P99:U104),IF($L$8=\"TRIMESTRE\",SUM(P99:S104),IF($L$8=\"SEMESTRE\",SUM(P99:Q104),IF($L$8=\"AÑO\",SUM(P99:P104))))))","v":0},{"$f":"IF($L$8=\"MES\",SUM(AB99:AM104),IF($L$8=\"BIMESTRE\",SUM(V99:AA104),IF($L$8=\"TRIMESTRE\",SUM(T99:W104),IF($L$8=\"SEMESTRE\",SUM(R99:S104),IF($L$8=\"AÑO\",SUM(Q99:Q104))))))","v":0},{"$f":"IF($L$8=\"MES\",SUM(AN99:AY104),IF($L$8=\"BIMESTRE\",SUM(AB99:AG104),IF($L$8=\"TRIMESTRE\",SUM(X99:AA104),IF($L$8=\"SEMESTRE\",SUM(T99:U104),IF($L$8=\"AÑO\",SUM(R99:R104))))))","v":0},{"$f":"IF($L$8=\"MES\",SUM(AZ99:BK104),IF($L$8=\"BIMESTRE\",SUM(AH99:AM104),IF($L$8=\"TRIMESTRE\",SUM(AB99:AE104),IF($L$8=\"SEMESTRE\",SUM(V99:W104),IF($L$8=\"AÑO\",SUM(S99:S104))))))","v":0},{"$f":"IF($L$8=\"MES\",SUM(BL99:BW104),IF($L$8=\"BIMESTRE\",SUM(AN99:AS104),IF($L$8=\"TRIMESTRE\",SUM(AF99:AI104),IF($L$8=\"SEMESTRE\",SUM(X99:Y104),IF($L$8=\"AÑO\",SUM(T99:T104))))))","v":0},0]
[null,{"$f":"B105","v":"ADECUADAS PRÁCTICAS DEL MANEJO DEL ECOSISTEMA"},null,null,null,null,{"$f":"IF($L$8=\"MES\",SUM(P105:AA110),IF($L$8=\"BIMESTRE\",SUM(P105:U110),IF($L$8=\"TRIMESTRE\",SUM(P105:S110),IF($L$8=\"SEMESTRE\",SUM(P105:Q110),IF($L$8=\"AÑO\",SUM(P105:P110))))))","v":0},{"$f":"IF($L$8=\"MES\",SUM(AB105:AM110),IF($L$8=\"BIMESTRE\",SUM(V105:AA110),IF($L$8=\"TRIMESTRE\",SUM(T105:W110),IF($L$8=\"SEMESTRE\",SUM(R105:S110),IF($L$8=\"AÑO\",SUM(Q105:Q110))))))","v":0},{"$f":"IF($L$8=\"MES\",SUM(AN105:AY110),IF($L$8=\"BIMESTRE\",SUM(AB105:AG110),IF($L$8=\"TRIMESTRE\",SUM(X105:AA110),IF($L$8=\"SEMESTRE\",SUM(T105:U110),IF($L$8=\"AÑO\",SUM(R105:R110))))))","v":0},{"$f":"IF($L$8=\"MES\",SUM(AZ105:BK110),IF($L$8=\"BIMESTRE\",SUM(AH105:AM110),IF($L$8=\"TRIMESTRE\",SUM(AB105:AE110),IF($L$8=\"SEMESTRE\",SUM(V105:W110),IF($L$8=\"AÑO\",SUM(S105:S110))))))","v":0},{"$f":"IF($L$8=\"MES\",SUM(BL105:BW110),IF($L$8=\"BIMESTRE\",SUM(AN105:AS110),IF($L$8=\"TRIMESTRE\",SUM(AF105:AI110),IF($L$8=\"SEMESTRE\",SUM(X105:Y110),IF($L$8=\"AÑO\",SUM(T105:T110))))))","v":0},{"$f":"SUM(G133:K133)","v":0}]
[null,{"$f":"B111","v":"ADECUADAS CAPACIDADES DE LAS ENTIDADES A CARGO DE LA GESTIÓN DEL ECOSISTEMA"},null,null,null,null,{"$f":"IF($L$8=\"MES\",SUM(P111:AA115),IF($L$8=\"BIMESTRE\",SUM(P111:U115),IF($L$8=\"TRIMESTRE\",SUM(P111:S115),IF($L$8=\"SEMESTRE\",SUM(P111:Q115),IF($L$8=\"AÑO\",SUM(P111:P115))))))","v":0},{"$f":"IF($L$8=\"MES\",SUM(AB111:AM115),IF($L$8=\"BIMESTRE\",SUM(V111:AA115),IF($L$8=\"TRIMESTRE\",SUM(T111:W115),IF($L$8=\"SEMESTRE\",SUM(R111:S115),IF($L$8=\"AÑO\",SUM(Q111:Q115))))))","v":0},{"$f":"IF($L$8=\"MES\",SUM(AN111:AY115),IF($L$8=\"BIMESTRE\",SUM(AB111:AG115),IF($L$8=\"TRIMESTRE\",SUM(X111:AA115),IF($L$8=\"SEMESTRE\",SUM(T111:U115),IF($L$8=\"AÑO\",SUM(R111:R115))))))","v":0},{"$f":"IF($L$8=\"MES\",SUM(AZ111:BK115),IF($L$8=\"BIMESTRE\",SUM(AH111:AM115),IF($L$8=\"TRIMESTRE\",SUM(AB111:AE115),IF($L$8=\"SEMESTRE\",SUM(V111:W115),IF($L$8=\"AÑO\",SUM(S111:S115))))))","v":0},{"$f":"IF($L$8=\"MES\",SUM(BL111:BW115),IF($L$8=\"BIMESTRE\",SUM(AN111:AS115),IF($L$8=\"TRIMESTRE\",SUM(AF111:AI115),IF($L$8=\"SEMESTRE\",SUM(X111:Y115),IF($L$8=\"AÑO\",SUM(T111:T115))))))","v":0},{"$f":"SUM(G134:K134)","v":0}]
[null,"OTROS COSTOS",null,null,null,null,"AÑO",null,null,null,null,"META TOTAL"]
[null,null,null,null,null,null,"PERIODO"]
[null,null,null,null,null,null,1,2,3,4,5]
[null,{"$f":"B119","v":"GESTIÓN DEL PROYECTO"},null,null,null,null,{"$f":"IF($L$8=\"MES\",SUM(P119:AA119),IF($L$8=\"BIMESTRE\",SUM(P119:U119),IF($L$8=\"TRIMESTRE\",SUM(P119:S119),IF($L$8=\"SEMESTRE\",SUM(P119:Q119),IF($L$8=\"AÑO\",SUM(P119))))))","v":0},{"$f":"IF($L$8=\"MES\",SUM(AB119:AM119),IF($L$8=\"BIMESTRE\",SUM(V119:AA119),IF($L$8=\"TRIMESTRE\",SUM(T119:W119),IF($L$8=\"SEMESTRE\",SUM(R119:S119),IF($L$8=\"AÑO\",SUM(Q119))))))","v":0},{"$f":"IF($L$8=\"MES\",SUM(AN119:AY119),IF($L$8=\"BIMESTRE\",SUM(AB119:AG119),IF($L$8=\"TRIMESTRE\",SUM(X119:AA119),IF($L$8=\"SEMESTRE\",SUM(T119:U119),IF($L$8=\"AÑO\",SUM(R119))))))","v":0},{"$f":"IF($L$8=\"MES\",SUM(AZ119:BK119),IF($L$8=\"BIMESTRE\",SUM(AH119:AM119),IF($L$8=\"TRIMESTRE\",SUM(AB119:AE119),IF($L$8=\"SEMESTRE\",SUM(V119:W119),IF($L$8=\"AÑO\",SUM(S119))))))","v":0},{"$f":"IF($L$8=\"MES\",SUM(BL119:BW119),IF($L$8=\"BIMESTRE\",SUM(AN119:AS119),IF($L$8=\"TRIMESTRE\",SUM(AF119:AI119),IF($L$8=\"SEMESTRE\",SUM(X119:Y119),IF($L$8=\"AÑO\",SUM(T119))))))","v":0},{"$f":"SUM(G138:K138)","v":0}]
[null,{"$f":"B120","v":"EXPEDIENTE TÉCNICO"},null,null,null,null,{"$f":"IF($L$8=\"MES\",SUM(P120:AA120),IF($L$8=\"BIMESTRE\",SUM(P120:U120),IF($L$8=\"TRIMESTRE\",SUM(P120:S120),IF($L$8=\"SEMESTRE\",SUM(P120:Q120),IF($L$8=\"AÑO\",SUM(P120))))))","v":0},{"$f":"IF($L$8=\"MES\",SUM(AB120:AM120),IF($L$8=\"BIMESTRE\",SUM(V120:AA120),IF($L$8=\"TRIMESTRE\",SUM(T120:W120),IF($L$8=\"SEMESTRE\",SUM(R120:S120),IF($L$8=\"AÑO\",SUM(Q120))))))","v":0},{"$f":"IF($L$8=\"MES\",SUM(AN120:AY120),IF($L$8=\"BIMESTRE\",SUM(AB120:AG120),IF($L$8=\"TRIMESTRE\",SUM(X120:AA120),IF($L$8=\"SEMESTRE\",SUM(T120:U120),IF($L$8=\"AÑO\",SUM(R120))))))","v":0},{"$f":"IF($L$8=\"MES\",SUM(AZ120:BK120),IF($L$8=\"BIMESTRE\",SUM(AH120:AM120),IF($L$8=\"TRIMESTRE\",SUM(AB120:AE120),IF($L$8=\"SEMESTRE\",SUM(V120:W120),IF($L$8=\"AÑO\",SUM(S120))))))","v":0},{"$f":"IF($L$8=\"MES\",SUM(BL120:BW120),IF($L$8=\"BIMESTRE\",SUM(AN120:AS120),IF($L$8=\"TRIMESTRE\",SUM(AF120:AI120),IF($L$8=\"SEMESTRE\",SUM(X120:Y120),IF($L$8=\"AÑO\",SUM(T120))))))","v":0},0]
[null,{"$f":"B121","v":"SUPERVISIÓN DE EXPEDIENTE TÉCNICO"},null,null,null,null,{"$f":"IF($L$8=\"MES\",SUM(P121:AA121),IF($L$8=\"BIMESTRE\",SUM(P121:U121),IF($L$8=\"TRIMESTRE\",SUM(P121:S121),IF($L$8=\"SEMESTRE\",SUM(P121:Q121),IF($L$8=\"AÑO\",SUM(P121))))))","v":0},{"$f":"IF($L$8=\"MES\",SUM(AB121:AM121),IF($L$8=\"BIMESTRE\",SUM(V121:AA121),IF($L$8=\"TRIMESTRE\",SUM(T121:W121),IF($L$8=\"SEMESTRE\",SUM(R121:S121),IF($L$8=\"AÑO\",SUM(Q121))))))","v":0},{"$f":"IF($L$8=\"MES\",SUM(AN121:AY121),IF($L$8=\"BIMESTRE\",SUM(AB121:AG121),IF($L$8=\"TRIMESTRE\",SUM(X121:AA121),IF($L$8=\"SEMESTRE\",SUM(T121:U121),IF($L$8=\"AÑO\",SUM(R121))))))","v":0},{"$f":"IF($L$8=\"MES\",SUM(AZ121:BK121),IF($L$8=\"BIMESTRE\",SUM(AH121:AM121),IF($L$8=\"TRIMESTRE\",SUM(AB121:AE121),IF($L$8=\"SEMESTRE\",SUM(V121:W121),IF($L$8=\"AÑO\",SUM(S121))))))","v":0},{"$f":"IF($L$8=\"MES\",SUM(BL121:BW121),IF($L$8=\"BIMESTRE\",SUM(AN121:AS121),IF($L$8=\"TRIMESTRE\",SUM(AF121:AI121),IF($L$8=\"SEMESTRE\",SUM(X121:Y121),IF($L$8=\"AÑO\",SUM(T121))))))","v":0},0]
[null,{"$f":"B122","v":"SUPERVISIÓN DE EJECUCIÓN FÍSICA DEL PROYECTO Y LIQUIDACIÓN"},null,null,null,null,{"$f":"IF($L$8=\"MES\",SUM(P122:AA122),IF($L$8=\"BIMESTRE\",SUM(P122:U122),IF($L$8=\"TRIMESTRE\",SUM(P122:S122),IF($L$8=\"SEMESTRE\",SUM(P122:Q122),IF($L$8=\"AÑO\",SUM(P122))))))","v":0},{"$f":"IF($L$8=\"MES\",SUM(AB122:AM122),IF($L$8=\"BIMESTRE\",SUM(V122:AA122),IF($L$8=\"TRIMESTRE\",SUM(T122:W122),IF($L$8=\"SEMESTRE\",SUM(R122:S122),IF($L$8=\"AÑO\",SUM(Q122))))))","v":0},{"$f":"IF($L$8=\"MES\",SUM(AN122:AY122),IF($L$8=\"BIMESTRE\",SUM(AB122:AG122),IF($L$8=\"TRIMESTRE\",SUM(X122:AA122),IF($L$8=\"SEMESTRE\",SUM(T122:U122),IF($L$8=\"AÑO\",SUM(R122))))))","v":0},{"$f":"IF($L$8=\"MES\",SUM(AZ122:BK122),IF($L$8=\"BIMESTRE\",SUM(AH122:AM122),IF($L$8=\"TRIMESTRE\",SUM(AB122:AE122),IF($L$8=\"SEMESTRE\",SUM(V122:W122),IF($L$8=\"AÑO\",SUM(S122))))))","v":0},{"$f":"IF($L$8=\"MES\",SUM(BL122:BW122),IF($L$8=\"BIMESTRE\",SUM(AN122:AS122),IF($L$8=\"TRIMESTRE\",SUM(AF122:AI122),IF($L$8=\"SEMESTRE\",SUM(X122:Y122),IF($L$8=\"AÑO\",SUM(T122))))))","v":0},0]

{"sheet":"O&M","index":51,"n_rows":130,"n_cols":14,"rows_kept":130,"cut":false,"hidden":false,"merged":[[7,4,7,13],[9,1,34,1],[9,2,24,2],[25,2,32,2],[33,2,33,3],[34,2,34,3],[61,1,62,1],[61,2,61,3],[62,2,62,3],[6,1,6,3],[7,1,8,3],[35,1,60,1],[35,2,50,2],[51,2,58,2],[59,2,59,3],[60,2,60,3],[128,1,129,1],[128,2,128,3],[129,2,129,3],[74,1,75,3],[74,4,74,13],[76,1,101,1],[76,2,91,2],[92,2,99,2],[100,2,100,3],[101,2,101,3],[102,1,127,1],[102,2,117,2],[118,2,125,2],[126,2,126,3],[127,2,127,3]]}
[]
[]
[]
[]
[]
[]
[]
[null,"COSTOS A PRECIOS DE MERCADO",null,null,"AÑOS (SOLES)"]
[null,null,null,null,1,2,3,4,5,6,7,8,9,10]
[null,"SIN PROYECTO\n(SP)","OPERACIÓN","PERSONAL",{"$f":"SUM(E11:E13)","v":0},{"$f":"SUM(F11:F13)","v":0},0,0,0,0,0,0,0,0]
[]
[]
[]
[null,null,null,"EQUIPOS Y/O HERRAMIENTAS",{"$f":"SUM(E15:E17)","v":0},0,0,0,0,0,0,0,0,0]
[]
[]
[]
[null,null,null,"BIENES DE CONSUMO",{"$f":"SUM(E19:E21)","v":0},0,0,0,0,0,0,0,0,0]
[]
[]
[]
[null,null,null,"SERVICIOS",{"$f":"SUM(E23:E25)","v":0},0,0,0,0,0,0,0,0,0]
[]
[]
[]
[null,null,"MANTENIMIENTO","BIENES DE CONSUMO",{"$f":"SUM(E27:E29)","v":0},0,0,0,0,0,0,0,0,0]
[]
[]
[]
[null,null,null,"SERVICIOS",{"$f":"SUM(E31:E33)","v":0},0,0,0,0,0,0,0,0,0]
[]
[]
[]
[null,null,"TOTAL OPERACIÓN SP",null,{"$f":"E10+E14+E18+E22","v":0},{"$f":"F10+F14+F18+F22","v":0},0,0,0,0,0,0,0,0]
[null,null,"TOTAL MANTENIMIENTO SP",null,{"$f":"E26+E30","v":0},{"$f":"F26+F30","v":0},0,0,0,0,0,0,0,0]
[null,"CON PROYECTO\n(CP)","OPERACIÓN","PERSONAL",{"$f":"SUM(E37:E39)","v":0},0,0,0,0,0,0,0,0,0]
[]
[]
[]
[null,null,null,"EQUIPOS Y/O HERRAMIENTAS",{"$f":"SUM(E41:E43)","v":0},0,0,0,0,0,0,0,0,0]
[]
[]
[]
[null,null,null,"BIENES DE CONSUMO",{"$f":"SUM(E45:E47)","v":0},0,0,0,0,0,0,0,0,0]
[]
[]
[]
[null,null,null,"SERVICIOS",{"$f":"SUM(E49:E51)","v":0},0,0,0,0,0,0,0,0,0]
[]
[]
[]
[null,null,"MANTENIMIENTO","BIENES DE CONSUMO",{"$f":"SUM(E53:E55)","v":0},0,0,0,0,0,0,0,0,0]
[]
[]
[]
[null,null,null,"SERVICIOS",{"$f":"SUM(E57:E59)","v":0},0,0,0,0,0,0,0,0,0]
[]
[]
[]
[null,null,"TOTAL OPERACIÓN CP",null,{"$f":"E36+E40+E44+E48","v":0},{"$f":"F36+F40+F44+F48","v":0},0,0,0,0,0,0,0,0]
[null,null,"TOTAL MANTENIMIENTO CP",null,{"$f":"E52+E56","v":0},{"$f":"F52+F56","v":0},0,0,0,0,0,0,0,0]
[null,"INCREMENTAL","OPERACIÓN",null,{"$f":"E60-E34","v":0},{"$f":"F60-F34","v":0},0,0,0,0,0,0,0,0]
[null,null,"MANTENIMIENTO",null,{"$f":"E61-E35","v":0},0,0,0,0,0,0,0,0,0]
[]
[]
[null,"FACTORES DE CORRECCIÓN"]
[null,"MANO DE OBRA NO CALIFICADA","UBANO","RURAL"]
[null,"LIMA METROPOLITANA",0.86,"-",null,"MANO DE OBRA CALIFICADA",0.92592592592592582]
[null,"RESTO COSTA",0.68,0.56999999999999995,null,"BIENES NACIONALES",0.84745762711864414]
[null,"SIERRA",0.6,0.41,null,"BIENEAS IMPORTADOS",0.81719128329297819]
[null,"SELVA",0.63,0.49,null,"SERVICIOS",0.84745762711864414]
[null,"Fuente: Anexo 11 Parámetros de Evaluación Social de la Directiva N° 001-2019-EF/63.01."]
[]
[]
[null,"COSTOS A PRECIOS SOCIALES",null,null,"AÑOS (SOLES)"]
[null,null,null,null,1,2,3,4,5,6,7,8,9,10]
[null,"SIN PROYECTO\n(SP)","OPERACIÓN","PERSONAL",{"$f":"SUM(E78:E80)","v":0},{"$f":"SUM(F78:F80)","v":0},0,0,0,0,0,0,0,0]
[null,null,null,null,0,0,0,0,0,0,0,0,0,0]
[null,null,null,null,0,0,0,0,0,0,0,0,0,0]
[null,null,null,null,0,0,0,0,0,0,0,0,0,0]
[null,null,null,"EQUIPOS Y/O HERRAMIENTAS",{"$f":"SUM(E82:E84)","v":0},{"$f":"SUM(F82:F84)","v":0},0,0,0,0,0,0,0,0]
[null,null,null,null,0,0,0,0,0,0,0,0,0,0]
[null,null,null,null,0,0,0,0,0,0,0,0,0,0]
[null,null,null,null,0,0,0,0,0,0,0,0,0,0]
[null,null,null,"BIENES DE CONSUMO",{"$f":"SUM(E86:E88)","v":0},{"$f":"SUM(F86:F88)","v":0},0,0,0,0,0,0,0,0]
[null,null,null,null,0,0,0,0,0,0,0,0,0,0]
[null,null,null,null,0,0,0,0,0,0,0,0,0,0]
[null,null,null,null,0,0,0,0,0,0,0,0,0,0]
[null,null,null,"SERVICIOS",{"$f":"SUM(E90:E92)","v":0},{"$f":"SUM(F90:F92)","v":0},0,0,0,0,0,0,0,0]
[null,null,null,null,0,0,0,0,0,0,0,0,0,0]
[null,null,null,null,0,0,0,0,0,0,0,0,0,0]
[null,null,null,null,0,0,0,0,0,0,0,0,0,0]
[null,null,"MANTENIMIENTO","BIENES DE CONSUMO",{"$f":"SUM(E94:E96)","v":0},{"$f":"SUM(F94:F96)","v":0},0,0,0,0,0,0,0,0]
[null,null,null,null,0,0,0,0,0,0,0,0,0,0]
[null,null,null,null,0,0,0,0,0,0,0,0,0,0]
[null,null,null,null,0,0,0,0,0,0,0,0,0,0]
[null,null,null,"SERVICIOS",{"$f":"SUM(E98:E100)","v":0},{"$f":"SUM(F98:F100)","v":0},0,0,0,0,0,0,0,0]
[null,null,null,null,0,0,0,0,0,0,0,0,0,0]
[null,null,null,null,0,0,0,0,0,0,0,0,0,0]
[null,null,null,null,0,0,0,0,0,0,0,0,0,0]
[null,null,"TOTAL OPERACIÓN SP",null,{"$f":"E77+E81+E85+E89","v":0},{"$f":"F77+F81+F85+F89","v":0},0,0,0,0,0,0,0,0]
[null,null,"TOTAL MANTENIMIENTO SP",null,{"$f":"E93+E97","v":0},{"$f":"F93+F97","v":0},0,0,0,0,0,0,0,0]
[null,"CON PROYECTO\n(CP)","OPERACIÓN","PERSONAL",{"$f":"SUM(E104:E106)","v":0},{"$f":"SUM(F104:F106)","v":0},0,0,0,0,0,0,0,0]
[null,null,null,null,0,0,0,0,0,0,0,0,0,0]
[null,null,null,null,0,0,0,0,0,0,0,0,0,0]
[null,null,null,null,0,0,0,0,0,0,0,0,0,0]
[null,null,null,"EQUIPOS Y/O HERRAMIENTAS",{"$f":"SUM(E108:E110)","v":0},{"$f":"SUM(F108:F110)","v":0},0,0,0,0,0,0,0,0]
[null,null,null,null,0,0,0,0,0,0,0,0,0,0]
[null,null,null,null,0,0,0,0,0,0,0,0,0,0]
[null,null,null,null,0,0,0,0,0,0,0,0,0,0]
[null,null,null,"BIENES DE CONSUMO",{"$f":"SUM(E112:E114)","v":0},{"$f":"SUM(F112:F114)","v":0},0,0,0,0,0,0,0,0]
[null,null,null,null,0,0,0,0,0,0,0,0,0,0]
[null,null,null,null,0,0,0,0,0,0,0,0,0,0]
[null,null,null,null,0,0,0,0,0,0,0,0,0,0]
[null,null,null,"SERVICIOS",{"$f":"SUM(E116:E118)","v":0},{"$f":"SUM(F116:F118)","v":0},0,0,0,0,0,0,0,0]
[null,null,null,null,0,0,0,0,0,0,0,0,0,0]
[null,null,null,null,0,0,0,0,0,0,0,0,0,0]
[null,null,null,null,0,0,0,0,0,0,0,0,0,0]
[null,null,"MANTENIMIENTO","BIENES DE CONSUMO",{"$f":"SUM(E120:E122)","v":0},{"$f":"SUM(F120:F122)","v":0},0,0,0,0,0,0,{"$f":"SUM(M120:M122)","v":0},{"$f":"SUM(N120:N122)","v":0}]
[null,null,null,null,0,0,0,0,0,0,0,0,0,0]
[null,null,null,null,0,0,0,0,0,0,0,0,0,0]
[null,null,null,null,0,0,0,0,0,0,0,0,0,0]
[null,null,null,"SERVICIOS",{"$f":"SUM(E124:E126)","v":0},{"$f":"SUM(F124:F126)","v":0},0,0,0,0,0,0,0,0]
[null,null,null,null,0,0,0,0,0,0,0,0,0,0]
[null,null,null,null,0,0,0,0,0,0,0,0,0,0]
[null,null,null,null,0,0,0,0,0,0,0,0,0,0]
[null,null,"TOTAL OPERACIÓN CP",null,{"$f":"E103+E107+E111+E115","v":0},{"$f":"F103+F107+F111+F115","v":0},0,0,0,0,0,0,0,0]
[null,null,"TOTAL MANTENIMIENTO CP",null,{"$f":"E119+E123","v":0},{"$f":"F119+F123","v":0},0,0,0,0,0,0,0,0]
[null,"INCREMENTAL","OPERACIÓN",null,{"$f":"E127-E101","v":0},{"$f":"F127-F101","v":0},0,0,0,0,0,0,0,0]
[null,null,"MANTENIMIENTO",null,{"$f":"E128-E102","v":0},0,0,0,0,0,0,0,0,0]

{"sheet":"FLUJO DE COSTOS","index":52,"n_rows":74,"n_cols":16,"rows_kept":74,"cut":false,"hidden":false,"merged":[[6,1,6,2],[8,1,9,1],[39,1,40,1],[10,1,10,11],[19,1,19,11],[25,1,25,11],[39,2,39,14],[8,2,8,14],[9,2,9,4],[40,2,40,4],[8,15,9,15],[39,15,40,15],[72,1,72,11],[50,1,50,11],[56,1,56,11],[41,1,41,11]]}
[]
[]
[]
[]
[]
[]
[]
[null,"INCREMENTALES A PRECIOS PRIVADOS"]
[null,"COMPONENTE","PERIODO",null,null,null,null,null,null,null,null,null,null,null,null,"TOTAL"]
[null,null,"Ejecución",null,null,1,2,3,4,5,6,7,8,9,10]
[]
[null,{"$f":"'6.PROBLEMA-OBJETIVO'!C102","v":"RECUPERACIÓN DE LA COBERTURA VEGETAL NATIVA DEL ECOSISTEMA PRINCIPAL"},null,null,null,null,null,null,null,null,null,null,null,null,null,{"$f":"'COSTOS UNITARIOS'!R111","v":0}]
[null,{"$f":"'6.PROBLEMA-OBJETIVO'!C105","v":"RECUPERACIÓN DE LAS CARACTERÍSTICAS DE LA TURBA DEL ECOSISTEMA PRINCIPAL"},null,null,null,null,null,null,null,null,null,null,null,null,null,{"$f":"'COSTOS UNITARIOS'!R112","v":0}]
[null,{"$f":"'6.PROBLEMA-OBJETIVO'!C107","v":"RECUPERACIÓN DE LA COBERTURA VEGETAL DE LOS ECOSISTEMAS ASOCIADOS"},null,null,null,null,null,null,null,null,null,null,null,null,null,{"$f":"'COSTOS UNITARIOS'!R113","v":0}]
[null,{"$f":"'6.PROBLEMA-OBJETIVO'!C111","v":"RECUPERACIÓN DE LAS CARACTERÍSTICAS DEL SUELO DEL ECOSISTEMA ASOCIADO"},null,null,null,null,null,null,null,null,null,null,null,null,null,{"$f":"'COSTOS UNITARIOS'!R114","v":0}]
[null,{"$f":"'6.PROBLEMA-OBJETIVO'!C113","v":"ADAPTACIÓN A LOS REGÍMENES DE PRECIPITACIÓN Y TEMPERATURAS"},null,null,null,null,null,null,null,null,null,null,null,null,null,{"$f":"'COSTOS UNITARIOS'!R115","v":0}]
[null,{"$f":"'6.PROBLEMA-OBJETIVO'!C119","v":"ADECUADAS PRÁCTICAS DEL MANEJO DEL ECOSISTEMA"},null,null,null,null,null,null,null,null,null,null,null,null,null,{"$f":"'COSTOS UNITARIOS'!R116","v":0}]
[null,{"$f":"'6.PROBLEMA-OBJETIVO'!C125","v":"ADECUADAS CAPACIDADES DE LAS ENTIDADES A CARGO DE LA GESTIÓN DEL ECOSISTEMA"},null,null,null,null,null,null,null,null,null,null,null,null,null,{"$f":"'COSTOS UNITARIOS'!R117","v":0}]
[null,"TOTAL DE COSTOS DESARROLLADOS EN LA RECUPERACIÓN DE ECOSISTEMAS",{"$f":"SUM(C12:C18)","v":0},{"$f":"SUM(D12:D18)","v":0},{"$f":"SUM(E12:E18)","v":0},0,0,0,0,0,0,0,0,0,0,{"$f":"SUM(C19:O19)","v":0}]
[]
[null,{"$f":"+'9.COSTOS '!B33:E33","v":"GESTIÓN DEL PROYECTO"},null,null,null,null,null,null,null,null,null,null,null,null,null,{"$f":"+'COSTOS UNITARIOS'!R121","v":0}]
[null,{"$f":"+'9.COSTOS '!B34:E34","v":"EXPEDIENTE TÉCNICO"},null,null,null,null,null,null,null,null,null,null,null,null,null,{"$f":"+'COSTOS UNITARIOS'!R122","v":0}]
[null,{"$f":"+'9.COSTOS '!B35:E35","v":"SUPERVISIÓN DE EXPEDIENTE TÉCNICO"},null,null,null,null,null,null,null,null,null,null,null,null,null,{"$f":"+'COSTOS UNITARIOS'!R123","v":0}]
[null,{"$f":"+'9.COSTOS '!B36:E36","v":"SUPERVISIÓN DE EJECUCIÓN FÍSICA DEL PROYECTO Y LIQUIDACIÓN"},null,null,null,null,null,null,null,null,null,null,null,null,null,{"$f":"+'COSTOS UNITARIOS'!R124","v":0}]
[null,"TOTAL DE COSTOS DESARROLLADOS EN LA GESTIÓN DEL PROYECTO",{"$f":"SUM(C21:C24)","v":0},{"$f":"SUM(D21:D24)","v":0},{"$f":"SUM(E21:E24)","v":0},0,0,0,0,0,0,0,0,0,0,{"$f":"SUM(C25:O25)","v":0}]
[]
[null,"MANTENIMIENTO",null,null,null,{"$f":"'O&M'!E61","v":0},{"$f":"'O&M'!F61","v":0},{"$f":"'O&M'!G61","v":0},{"$f":"'O&M'!H61","v":0},{"$f":"'O&M'!I61","v":0},{"$f":"'O&M'!J61","v":0},{"$f":"'O&M'!K61","v":0},{"$f":"'O&M'!L61","v":0},{"$f":"'O&M'!M61","v":0},{"$f":"'O&M'!N61","v":0}]
[null,"OPERACIÓN",null,null,null,{"$f":"'O&M'!E60","v":0},{"$f":"'O&M'!F60","v":0},{"$f":"'O&M'!G60","v":0},{"$f":"'O&M'!H60","v":0},{"$f":"'O&M'!I60","v":0},{"$f":"'O&M'!J60","v":0},{"$f":"'O&M'!K60","v":0},{"$f":"'O&M'!L60","v":0},{"$f":"'O&M'!M60","v":0},{"$f":"'O&M'!N60","v":0}]
[null,"TOTAL COSTOS OPERACIÓN Y MANTENIMIENTO CON PROYECTO",null,null,null,{"$f":"SUM(F27:F28)","v":0},0,0,0,{"$f":"SUM(J27:J28)","v":0},0,0,{"$f":"SUM(M27:M28)","v":0},{"$f":"SUM(N27:N28)","v":0},{"$f":"SUM(O27:O28)","v":0}]
[null,"MANTENIMIENTO",null,null,null,{"$f":"+'O&M'!E35","v":0},{"$f":"+'O&M'!F35","v":0},{"$f":"+'O&M'!G35","v":0},{"$f":"+'O&M'!H35","v":0},{"$f":"+'O&M'!I35","v":0},{"$f":"+'O&M'!J35","v":0},{"$f":"+'O&M'!K35","v":0},{"$f":"+'O&M'!L35","v":0},{"$f":"+'O&M'!M35","v":0},{"$f":"+'O&M'!N35","v":0}]
[null,"OPERACIÓN",null,null,null,{"$f":"+'O&M'!E34","v":0},{"$f":"+'O&M'!F34","v":0},{"$f":"+'O&M'!G34","v":0},{"$f":"+'O&M'!H34","v":0},{"$f":"+'O&M'!I34","v":0},{"$f":"+'O&M'!J34","v":0},{"$f":"+'O&M'!K34","v":0},{"$f":"+'O&M'!L34","v":0},{"$f":"+'O&M'!M34","v":0},{"$f":"+'O&M'!N34","v":0}]
[null,"TOTAL COSTOS OPERACIÓN Y MANTENIMIENTO SIN PROYECTO",null,null,null,{"$f":"SUM(F30:F31)","v":0},0,0,0,0,0,0,0,0,0]
[null,"TOTAL COSTOS INCREMENTALES OPERACIÓN Y MANTENIMIENTO (S/.)",null,null,null,{"$f":"F29-F32","v":0},0,0,0,0,0,0,{"$f":"M29-M32","v":0},{"$f":"N29-N32","v":0},{"$f":"O29-O32","v":0}]
[null,"FLUJO COSTOS (S/.)",{"$f":"C25","v":0},{"$f":"+D25+D33","v":0},0,0,0,0,0,0,0,0,{"$f":"+M25+M33","v":0},{"$f":"+N25+N33","v":0},{"$f":"+O25+O33","v":0}]
[null,"VACS (8%)",{"$f":"NPV(8%,D34:O34)+C34","v":0}]
[]
[]
[]
[null,"INCREMENTALES A PRECIOS SOCIALES"]
[null,"COMPONENTE","PERIODO",null,null,null,null,null,null,null,null,null,null,null,null,"TOTAL"]
[null,null,"Ejecución",null,null,1,2,3,4,5,6,7,8,9,10]
[]
[null,{"$f":"B12","v":"RECUPERACIÓN DE LA COBERTURA VEGETAL NATIVA DEL ECOSISTEMA PRINCIPAL"},null,null,null,null,null,null,null,null,null,null,null,null,null,{"$f":"'COSTOS UNITARIOS'!R235","v":0}]
[null,"RECUPERACIÓN DE LAS CARACTERÍSTICAS DE LA TURBA DEL ECOSISTEMA PRINCIPAL",null,null,null,null,null,null,null,null,null,null,null,null,null,{"$f":"'COSTOS UNITARIOS'!R236","v":0}]
[null,"RECUPERACIÓN DE LA COBERTURA VEGETAL DE LOS ECOSISTEMAS ASOCIADOS",null,null,null,null,null,null,null,null,null,null,null,null,null,{"$f":"'COSTOS UNITARIOS'!R237","v":0}]
[null,"RECUPERACIÓN DE LAS CARACTERÍSTICAS DEL SUELO DEL ECOSISTEMA ASOCIADO",null,null,null,null,null,null,null,null,null,null,null,null,null,{"$f":"'COSTOS UNITARIOS'!R238","v":0}]
[null,"ADAPTACIÓN A LOS REGÍMENES DE PRECIPITACIÓN Y TEMPERATURAS",null,null,null,null,null,null,null,null,null,null,null,null,null,{"$f":"'COSTOS UNITARIOS'!R239","v":0}]
[null,"ADECUADAS PRÁCTICAS DEL MANEJO DEL ECOSISTEMA",null,null,null,null,null,null,null,null,null,null,null,null,null,{"$f":"'COSTOS UNITARIOS'!R240","v":0}]
[null,"ADECUADAS CAPACIDADES DE LAS ENTIDADES A CARGO DE LA GESTIÓN DEL ECOSISTEMA",null,null,null,null,null,null,null,null,null,null,null,null,null,{"$f":"'COSTOS UNITARIOS'!R241","v":0}]
[null,"TOTAL DE COSTOS DESARROLLADOS EN LA RECUPERACIÓN DE ECOSISTEMAS",{"$f":"SUM(C43:C49)","v":0},{"$f":"SUM(D43:D49)","v":0},{"$f":"SUM(E43:E49)","v":0},0,0,0,0,0,0,0,0,0,0,{"$f":"SUM(C50:O50)","v":0}]
[]
[null,{"$f":"+B21","v":"GESTIÓN DEL PROYECTO"},null,null,null,null,null,null,null,null,null,null,null,null,null,{"$f":"'COSTOS UNITARIOS'!R245","v":0}]
[null,{"$f":"+B22","v":"EXPEDIENTE TÉCNICO"},null,null,null,null,null,null,null,null,null,null,null,null,null,{"$f":"'COSTOS UNITARIOS'!R246","v":0}]
[null,{"$f":"+B23","v":"SUPERVISIÓN DE EXPEDIENTE TÉCNICO"},null,null,null,null,null,null,null,null,null,null,null,null,null,{"$f":"'COSTOS UNITARIOS'!R247","v":0}]
[null,{"$f":"+B24","v":"SUPERVISIÓN DE EJECUCIÓN FÍSICA DEL PROYECTO Y LIQUIDACIÓN"},null,null,null,null,null,null,null,null,null,null,null,null,null,{"$f":"'COSTOS UNITARIOS'!R248","v":0}]
[null,"OTROS COSTOS DEL PROYECTO",{"$f":"SUM(C52:C55)","v":0},0,0,0,0,0,0,0,0,0,0,0,0,{"$f":"SUM(C56:O56)","v":0}]
[]
[null,"MANTENIMIENTO",null,null,null,{"$f":"'O&M'!G128","v":0},{"$f":"'O&M'!H128","v":0},{"$f":"'O&M'!I128","v":0},{"$f":"'O&M'!J128","v":0},{"$f":"'O&M'!K128","v":0},{"$f":"'O&M'!L128","v":0},{"$f":"'O&M'!M128","v":0},{"$f":"'O&M'!N128","v":0},{"$f":"'O&M'!O128","v":0},{"$f":"'O&M'!P128","v":0}]
[null,"OPERACIÓN",null,null,null,{"$f":"'O&M'!G127","v":0},{"$f":"'O&M'!H127","v":0},{"$f":"'O&M'!I127","v":0},{"$f":"'O&M'!J127","v":0},{"$f":"'O&M'!K127","v":0},{"$f":"'O&M'!L127","v":0},{"$f":"'O&M'!M127","v":0},{"$f":"'O&M'!N127","v":0},{"$f":"'O&M'!O127","v":0},{"$f":"'O&M'!P127","v":0}]
[null,"TOTAL COSTOS OPERACIÓN Y MANTENIMIENTO CON PROYECTO",null,null,null,{"$f":"SUM(F58:F59)","v":0},0,0,0,0,0,0,{"$f":"SUM(M58:M59)","v":0},{"$f":"SUM(N58:N59)","v":0},{"$f":"SUM(O58:O59)","v":0}]
[null,"MANTENIMIENTO",null,null,null,{"$f":"'O&M'!G102","v":0},{"$f":"'O&M'!H102","v":0},{"$f":"'O&M'!I102","v":0},{"$f":"'O&M'!J102","v":0},{"$f":"'O&M'!K102","v":0},{"$f":"'O&M'!L102","v":0},{"$f":"'O&M'!M102","v":0},{"$f":"'O&M'!N102","v":0},{"$f":"'O&M'!O102","v":0},{"$f":"'O&M'!P102","v":0}]
[null,"OPERACIÓN",null,null,null,{"$f":"'O&M'!G101","v":0},{"$f":"'O&M'!H101","v":0},{"$f":"'O&M'!I101","v":0},{"$f":"'O&M'!J101","v":0},{"$f":"'O&M'!K101","v":0},{"$f":"'O&M'!L101","v":0},{"$f":"'O&M'!M101","v":0},{"$f":"'O&M'!N101","v":0},{"$f":"'O&M'!O101","v":0},{"$f":"'O&M'!P101","v":0}]
[null,"TOTAL COSTOS OPERACIÓN Y MANTENIMIENTO SIN PROYECTO",null,null,null,{"$f":"+F62+F61","v":0},0,0,0,0,0,0,{"$f":"+M62+M61","v":0},{"$f":"+N62+N61","v":0},{"$f":"+O62+O61","v":0}]
[null,"TOTAL COSTOS INCREMENTALES OPERACIÓN Y MANTENIMIENTO (S/.)",null,null,null,{"$f":"F60-F63","v":0},0,0,0,0,0,0,{"$f":"M60-M63","v":0},{"$f":"N60-N63","v":0},{"$f":"O60-O63","v":0}]
[null,"FLUJO COSTOS (S/.)",{"$f":"C56","v":0},{"$f":"+D56+D64","v":0},{"$f":"+E56+E64","v":0},{"$f":"+F56+F64","v":0},0,0,0,0,0,0,{"$f":"+M56+M64","v":0},{"$f":"+N56+N64","v":0},{"$f":"+O56+O64","v":0}]
[null,"VACS (8%)",{"$f":"NPV(8%,D65:O65)+C65","v":0}]
[null,"COSTO EFICACIA",{"$f":"+C66/C68","v":{"$error":"#DIV/0!"}}]
[null,"TOTAL HECTÁREA",{"$f":"'4.UNIDAD PRODUCTORA'!O58","v":0}]
[null,"COSTO POR HECTÁREA",{"$f":"SUM(C65:E65)/C68","v":{"$error":"#DIV/0!"}}]
[null,"TOTAL M3*"]
[null,"COSTO POR M3",{"$f":"SUM(C65:E65)/C70","v":{"$error":"#DIV/0!"}}]
[null,"COSTO EFICACIA*",{"$f":"+C66/C70","v":{"$error":"#DIV/0!"}}]
[null,"(*) Cabe señalar que el indicador para la estimación de la disminución del servicio ecosistémico de regulación hídrica es el caudal en epoca de estiaje en el punto de captación (m3/año), para ello se utiliza el método RAS en situación Sin Proyecto (S/P) - pestaña \"Comunicación Técnica\", o recopilacion de información de aforadores o data histórica de volumen del agua capturado de los usuarios (poblacionall, agrícola) u otro metodologia."]
[null,"Nota: Cabe señalar que el horizonte de evaluación del proyecto se define en función al periodo de ejecución y al periodo de funcionamiento del proyecto, según la pestaña \"Horizonte de evaluación\"."]

{"sheet":"SOLICITUD SEIA","index":53,"n_rows":0,"n_cols":0,"rows_kept":0,"cut":false,"hidden":true,"merged":[]}

{"sheet":"ACCIONES DE RESILENCIA","index":54,"n_rows":19,"n_cols":4,"rows_kept":19,"cut":false,"hidden":true,"merged":[]}
[]
[]
[]
[]
[]
[]
[]
[]
[null,null,"N°","ACCIONES DE RESILENCIA"]
[null,null,1,"Elaboracion de plan de prevención de riesgos de desastres"]
[null,null,2,"Elaboracion de plan de remedación ambiental"]
[null,null,3,"Elaboracion de plan de emergencia ante riesgos de desastres o interrupcion en el funcionamiento de agua para consumo poblacional/agua para riego"]
[null,null,4,"Elaboracion de protocolos de actuación ante riesgos de desastres"]
[null,null,5,"Capacitación a los beneficiarios y autoridades sobre conservación ambiental y cuidado de fuentes de agua"]
[null,null,6,"Capacitación a los beneficiarios y autoridades sobre Manejo de Cuencas"]
[null,null,7,"Capacitación a los beneficiarios y autoridades sobre Gestión de riesgos de desastres"]
[null,null,8,"Capacitacion a los recursos humanos encargados de la operación y mantenimiento del servicio"]
[null,null,9,"Implementación de brigadas comunales de cuidado de fuentes de agua"]
[null,null,10,"Adquisición de equipamiento y herramientas adicionales para la operación y mantenimiento"]

{"sheet":"ESTUDIOS ESPECIALIZADOS","index":55,"n_rows":56,"n_cols":4,"rows_kept":56,"cut":false,"hidden":true,"merged":[[53,2,53,11],[29,2,29,11],[33,2,33,11],[38,2,38,11],[43,2,43,11],[48,2,48,11],[34,2,35,2],[34,3,34,11],[35,3,35,11],[15,2,15,11],[10,2,10,11],[11,2,12,2],[11,3,11,11],[12,3,12,11],[16,2,18,2],[16,3,16,11],[17,3,17,11],[18,3,18,11],[22,3,22,11],[26,3,26,11],[30,3,30,11],[21,2,21,11],[25,2,25,11],[54,2,55,2],[54,3,54,11],[55,3,55,11],[39,2,40,2],[39,3,39,11],[40,3,40,11],[44,2,45,2],[44,3,44,11],[45,3,45,11],[49,2,50,2],[49,3,49,11],[50,3,50,11]]}
[]
[]
[]
[]
[]
[]
[]
[]
[]
[]
[null,null," I. REFORESTACION CON ESPECIES NATIVAS"]
[null,null,"Estudios","Imágenes satelitales representativas de la zona degradada para la realización de un análisis histórico comparativo del estado del ecosistema, en un rango aproximado de 10 a 30 años. "]
[null,null,null,"Estudios de composición del suelo por tipo de ecosistema y las especies de cobertura vegetal predominantes."]
[]
[]
[null,null,"II. REVEGETACIÓN CON ESPECIES NATIVAS"]
[null,null,"Estudios","Imágenes satelitales representativas de la zona degradada para la realización de un análisis histórico comparativo del estado del ecosistema, en un rango aproximado de 10 a 30 años. "]
[null,null,null,"Estudios de composición del suelo por tipo de ecosistema ( PH o acidez del suelo o salinidad del suelo)"]
[null,null,null,"Estudios de composición del suelo por tipo de ecosistema y las especies de cobertura vegetal predominantes."]
[]
[]
[null,null,"III. INSTALACIÓN DE EXCLUIDORES"]
[null,null,"Estudios","Imágenes satelitales representativas de la zona degradada para la realización de un análisis histórico comparativo del estado del ecosistema, en un rango aproximado de 10 a 30 años. "]
[]
[]
[null,null,"IV. CONTROL DE CARCAVAS"]
[null,null,"Estudios","Imágenes satelitales representativas de la zona degradada para la realización de un análisis histórico comparativo del estado del ecosistema, en un rango aproximado de 10 a 30 años. "]
[]
[]
[null,null,"V.INSTALACIÓN DE TERRAZAS DE FORMACIÓN LENTA"]
[null,null,"Estudios","Imágenes satelitales representativas de la zona degradada para la realización de un análisis histórico comparativo del estado del ecosistema, en un rango aproximado de 10 a 30 años. "]
[]
[]
[null,null,"VI. FITORREMEDIACIÓN DE AGUAS"]
[null,null,"Estudios","Imágenes satelitales representativas de la zona degradada para la realización de un análisis histórico comparativo del estado del ecosistema, en un rango aproximado de 10 a 30 años. "]
[null,null,null,"Estudios de recurso calidad de agua  (Analisis de incorporacion de sedimentos y contaminacion por metales del recurso hidrico)"]
[]
[]
[null,null,"VII. MEJORAMIENTO DE AMUNAS"]
[null,null,"Estudios","Estudio de identificación de la geomorfología de la zona (tipo de suelos, pendientes)"]
[null,null,null,"Estudio de las fuentes hídricas aledañas y la situación de los canales, según sus niveles de erosión."]
[]
[]
[null,null,"VIII. MEJORAMIENTO DE CANALES DE MAMANTEO"]
[null,null,"Estudios","Estudio de identificación de la geomorfología de la zona (tipo de suelos, pendientes)"]
[null,null,null,"Estudio de las fuentes hídricas aledañas y la situación de los canales, según sus niveles de erosión.\n"]
[]
[]
[null,null,"IX. CONSTRUCCIÓN DE ZANJAS DE INFILTRACIÓN"]
[null,null,"Estudios","Estudio de identificación de la geomorfología de la zona (tipo de suelos, textura,  pendientes)"]
[null,null,null,"Estudios de composición del suelo por tipo de ecosistema y las especies de cobertura vegetal predominantes."]
[]
[]
[null,null," X. INSTALACIÓN DE QOCHAS"]
[null,null,"Estudios","Estudio de identificación de la geomorfología de la zona (tipo de suelos, textura,  pendientes)"]
[null,null,null,"Estudio de topografia del suelo\n"]

{"sheet":"DETALLE DEL COSTO TOTAL","index":56,"n_rows":91,"n_cols":49,"rows_kept":91,"cut":false,"hidden":true,"merged":[[4,28,4,29],[4,20,4,21],[1,20,1,29],[1,31,1,38],[1,40,1,47],[2,20,2,21],[2,28,2,29],[1,11,1,18],[1,1,2,3],[1,4,2,4],[1,5,2,5],[1,6,2,6],[1,8,2,8]]}
[]
[null,"Descripción",null,null,"Unidad de Medida","Meta","Costo Unitario","Costo Total S/","Factor Corrección","Costo Total S/",null,"Cronograma de Ejecución (Trimestral)",null,null,null,null,null,null,null,null,"Cronograma de Ejecución Gantt (Trimestral)",null,null,null,null,null,null,null,null,null,null,"Ejecución Financiera a precios privados en Soles (Trimestral)",null,null,null,null,null,null,null,null,"Ejecución Financiera a precios sociales en Soles (Trimestral)"]
[null,null,null,null,null,null,null,"P. Privados",null,"P. Sociales",null,1,2,3,4,5,6,7,8,null,1,null,2,3,4,5,6,7,8,null,null,1,2,3,4,5,6,7,8,null,1,2,3,4,5,6,7,8]
[]
[null,"COMPONENTE 1.Fortalecimiento de capacidades para la planificación y generación de información temática para …",null,null,null,null,null,{"$f":"+H6+H28","v":665410.96},null,{"$f":"+J6+J28","v":591763.86440677964},null,null,null,null,null,null,null,null,null,null,null,null,null,null,null,null,null,null,null,null,null,{"$f":"+AF6+AF28","v":133090.96},135136,88944,88944,75296,48000,48000,48000,{"$f":"+H5-SUM(AF5:AM5)","v":0},{"$f":"+AO6+AO28","v":116270.98305084747},118004.06779661018,78858.305084745763,78858.305084745763,67292.203389830509,44160,44160,44160,{"$f":"+J5-SUM(AO5:AV5)","v":0}]
[null,"Acción  1.1","…",null,null,null,null,{"$f":"+SUM(H7:H27)","v":528930.96},null,{"$f":"+SUM(J7:J27)","v":476102.84745762707},null,null,null,null,null,null,null,null,null,null,null,null,null,null,null,null,null,null,null,null,null,{"$f":"+SUM(AF7:AF27)","v":133090.96},{"$f":"+SUM(AG7:AG27)","v":107840},48000,48000,48000,48000,48000,48000,{"$f":"+H6-SUM(AF6:AM6)","v":0},{"$f":"+SUM(AO7:AO27)","v":116270.98305084747},{"$f":"+SUM(AP7:AP27)","v":94871.86440677967},44160,44160,44160,44160,44160,44160,{"$f":"+J6-SUM(AO6:AV6)","v":0}]
[null,"Act. 1.1.1"," YYYYY",null,null,null,null,null,null,null,null,null,null,null,null,null,null,null,null,null,null,null,null,null,null,null,null,null,null,null,null,null,null,null,null,null,null,null,null,0,null,null,null,null,null,null,null,null,0]
[null,null,"Tarea 1.1.1.1","ZZZZ","Taller",5,4000,{"$f":"+G8*F8","v":20000},{"$f":"1/(1.18)","v":0.84745762711864414},{"$f":"+I8*H8","v":16949.152542372882},null,1,0,0,0,0,0,0,0,null,null,{"$f":"+L8","v":1},0,0,0,0,0,0,0,null,null,{"$f":"+L8*$H8","v":20000},0,0,0,0,0,0,0,0,{"$f":"+L8*$J8","v":16949.152542372882},{"$f":"+M8*$J8","v":0},0,0,0,0,0,0,0]
[null,null,"Tarea 1.1.1.2","KKKK","Publicación",1,{"$f":"(1136*1.18)*2","v":2680.96},{"$f":"+G9*F9","v":2680.96},{"$f":"1/(1.18)","v":0.84745762711864414},{"$f":"+I9*H9","v":2272.0000000000005},null,1,0,0,0,0,0,0,0,null,null,1,0,0,0,0,0,0,0,null,null,2680.96,0,0,0,0,0,0,0,0,{"$f":"+L9*$J9","v":2272.0000000000005},0,0,0,0,0,0,0,0]
[null,"Act. 1.1.2","Acompañamiento Técnico",null,null,null,null,null,null,null,null,null,null,null,null,null,null,null,null,null,null,null,null,null,null,null,null,null,null,null,null,null,null,null,null,null,null,null,null,0,null,null,null,null,null,null,null,null,0]
[null,null,"Tarea 1.1.2.1","Especialista SIG","mes",{"$f":"12*2","v":24},6000,{"$f":"+G11*F11","v":144000},0.92,{"$f":"+I11*H11","v":132480},null,0.125,0.125,0.125,0.125,0.125,0.125,0.125,0.125,null,null,{"$f":"+L11","v":0.125},0.125,0.125,0.125,0.125,0.125,0.125,0.125,null,null,{"$f":"+L11*$H11","v":18000},18000,18000,18000,18000,18000,18000,18000,0,{"$f":"+L11*$J11","v":16560},16560,16560,16560,16560,16560,16560,16560,0]
[null,null,"Tarea 1.1.2.2","Especialista Forestal","mes",{"$f":"12*2","v":24},6000,{"$f":"+G12*F12","v":144000},0.92,{"$f":"+I12*H12","v":132480},null,0.125,0.125,0.125,0.125,0.125,0.125,0.125,0.125,null,null,0.125,0.125,0.125,0.125,0.125,0.125,0.125,0.125,null,null,18000,18000,18000,18000,18000,18000,18000,18000,0,16560,16560,16560,16560,16560,16560,16560,16560,0]
[null,null,"Tarea 1.1.2.3","Sociologo ","mes",{"$f":"12*2","v":24},4000,{"$f":"+G13*F13","v":96000},0.92,{"$f":"+I13*H13","v":88320},null,0.125,0.125,0.125,0.125,0.125,0.125,0.125,0.125,null,null,0.125,0.125,0.125,0.125,0.125,0.125,0.125,0.125,null,null,12000,12000,12000,12000,12000,12000,12000,12000,0,11040,11040,11040,11040,11040,11040,11040,11040,0]
[null,"Act. 1.1.3","…",null,null,null,null,null,null,null,null,null,null,null,null,null,null,null,null,null,null,null,null,null,null,null,null,null,null,null,null,null,null,null,null,null,null,null,null,0,null,null,null,null,null,null,null,null,0]
[null,null,"Tarea 1.1.3.1","…",null,null,null,null,null,null,null,null,null,null,null,null,null,null,null,null,null,null,null,null,null,null,null,null,null,null,null,null,null,null,null,null,null,null,null,0,null,null,null,null,null,null,null,null,0]
[null,null,null,"…","Mes",1,2000,{"$f":"+G16*F16","v":2000},{"$f":"1/(1.18)","v":0.84745762711864414},{"$f":"+I16*H16","v":1694.9152542372883},null,1,0,0,0,0,0,0,0,null,null,{"$f":"+L16","v":1},0,0,0,0,0,0,0,null,null,{"$f":"+L16*$H16","v":2000},0,0,0,0,0,0,0,0,{"$f":"+L16*$J16","v":1694.9152542372883},0,0,0,0,0,0,0,0]
[null,null,null,"…","Mes",1,2250,{"$f":"+G17*F17","v":2250},0.84745762711864414,1906.7796610169494,null,1,0,0,0,0,0,0,0,null,null,1,0,0,0,0,0,0,0,null,null,2250,0,0,0,0,0,0,0,0,1906.7796610169494,0,0,0,0,0,0,0,0]
[null,null,null,"…","Global",1,1000,1000,0.84745762711864414,847.45762711864415,null,1,0,0,0,0,0,0,0,null,null,1,0,0,0,0,0,0,0,null,null,1000,0,0,0,0,0,0,0,0,847.45762711864415,0,0,0,0,0,0,0,0]
[null,null,null,"…","Global",1,1000,1000,0.84745762711864414,847.45762711864415,null,1,0,0,0,0,0,0,0,null,null,1,0,0,0,0,0,0,0,null,null,1000,0,0,0,0,0,0,0,0,847.45762711864415,0,0,0,0,0,0,0,0]
[null,null,null,"…","Millar",10,600,6000,0.84745762711864414,5084.7457627118647,null,1,0,0,0,0,0,0,0,null,null,1,0,0,0,0,0,0,0,null,null,6000,0,0,0,0,0,0,0,0,5084.7457627118647,0,0,0,0,0,0,0,0]
[null,null,null,"…","Millar",10,600,6000,0.84745762711864414,5084.7457627118647,null,1,0,0,0,0,0,0,0,null,null,1,0,0,0,0,0,0,0,null,null,6000,0,0,0,0,0,0,0,0,5084.7457627118647,0,0,0,0,0,0,0,0]
[null,null,"Tarea 1.1.3.2","…","Taller",3,{"$f":"+G8","v":4000},12000,0.84745762711864414,10169.491525423729,null,1,0,0,0,0,0,0,0,null,null,1,0,0,0,0,0,0,0,null,null,12000,0,0,0,0,0,0,0,0,10169.491525423729,0,0,0,0,0,0,0,0]
[null,null,"Tarea 1.1.3.3","…","día/persona",{"$f":"20*F22","v":60},320,19200,0.84745762711864414,16271.186440677968,null,1,0,0,0,0,0,0,0,null,null,1,0,0,0,0,0,0,0,null,null,19200,0,0,0,0,0,0,0,0,16271.186440677968,0,0,0,0,0,0,0,0]
[null,"Act. 1.1.4","Elaboración del Plan de Implementación …",null,null,null,null,null,null,null,null,null,null,null,null,null,null,null,null,null,null,null,null,null,null,null,null,null,null,null,null,null,null,null,null,null,null,null,null,0,null,null,null,null,null,null,null,null,0]
[null,null,"Tarea 1.1.4.1","Talleres de formulación …","Taller",5,{"$f":"+G22","v":4000},20000,{"$f":"1/(1.18)","v":0.84745762711864414},16949.152542372882,null,0.2,0.8,0,0,0,0,0,0,null,null,{"$f":"+L25","v":0.2},0.8,0,0,0,0,0,0,null,null,{"$f":"+L25*$H25","v":4000},16000,0,0,0,0,0,0,0,{"$f":"+L25*$J25","v":3389.8305084745766},13559.322033898306,0,0,0,0,0,0,0]
[null,null,"Tarea 1.1.4.2","Taller de presentación y validación …","Taller",2,{"$f":"+G25","v":4000},8000,{"$f":"1/(1.18)","v":0.84745762711864414},6779.6610169491532,null,0,1,0,0,0,0,0,0,null,null,0,1,0,0,0,0,0,0,null,null,0,8000,0,0,0,0,0,0,0,0,6779.6610169491532,0,0,0,0,0,0,0]
[null,null,"Tarea 1.1.4.3","…","día/persona",{"$f":"20*(F26+F25)","v":140},320,44800,{"$f":"1/(1.18)","v":0.84745762711864414},37966.101694915254,null,0.2,0.8,0,0,0,0,0,0,null,null,0.2,0.8,0,0,0,0,0,0,null,null,8960,35840,0,0,0,0,0,0,{"$f":"+H27-SUM(AF27:AM27)","v":0},7593.2203389830511,30372.881355932204,0,0,0,0,0,0,0]
[null,"Acción 1.2","…",null,null,null,null,{"$f":"+SUM(H29:H34)","v":136480},null,{"$f":"+SUM(J29:J34)","v":115661.01694915254},null,null,null,null,null,null,null,null,null,null,null,null,null,null,null,null,null,null,null,null,null,{"$f":"+SUM(AF29:AF34)","v":0},27296,40944,40944,27296,0,0,0,0,{"$f":"+SUM(AO29:AO34)","v":0},23132.203389830513,34698.305084745763,34698.305084745763,23132.203389830513,0,0,0,0]
[null,"Act. 1.2.1","Materiales de fortalecimiento de capacidades",null,"Mapa",12,2000,{"$f":"+G29*F29","v":24000},{"$f":"1/(1.18)","v":0.84745762711864414},20338.983050847459,null,0,0.2,0.3,0.3,0.2,0,0,0,null,null,{"$f":"+L29","v":0},0.2,0.3,0.3,0.2,0,0,0,null,null,{"$f":"+L29*$H29","v":0},4800,7200,7200,4800,0,0,0,0,{"$f":"+L29*$J29","v":0},4067.7966101694919,6101.6949152542375,6101.6949152542375,4067.7966101694919,0,0,0,0]
[null,"Act. 1.2.2","Herramientas participativas",null,"Global",1,10000,{"$f":"+G30*F30","v":10000},{"$f":"1/(1.18)","v":0.84745762711864414},8474.5762711864409,null,0,0.2,0.3,0.3,0.2,0,0,0,null,null,0,0.2,0.3,0.3,0.2,0,0,0,null,null,0,2000,3000,3000,2000,0,0,0,0,0,1694.9152542372883,2542.3728813559323,2542.3728813559323,1694.9152542372883,0,0,0,0]
[null,"Act. 1.2.3","Cursos especializados para …",null,null,null,null,null,null,null,null,null,null,null,null,null,null,null,null,null,null,null,null,null,null,null,null,null,null,null,null,null,null,null,null,null,null,null,null,0,null,null,null,null,null,null,null,null,0]
[null,null,"Tarea 1.2.1.1","Talleres de capacitación","Taller",12,{"$f":"+G8","v":4000},{"$f":"+G32*F32","v":48000},{"$f":"1/(1.18)","v":0.84745762711864414},40677.966101694918,null,0,0.2,0.3,0.3,0.2,0,0,0,null,null,{"$f":"+L32","v":0},0.2,0.3,0.3,0.2,0,0,0,null,null,{"$f":"+L32*$H32","v":0},9600,14400,14400,9600,0,0,0,0,{"$f":"+L32*$J32","v":0},8135.5932203389839,12203.389830508475,12203.389830508475,8135.5932203389839,0,0,0,0]
[null,null,"Tarea 1.2.1.2","Pasajes aéreos  (I/V)","Pasaje",{"$f":"4*F32","v":48},{"$f":"+G87","v":495},{"$f":"+G33*F33","v":23760},{"$f":"1/(1.18)","v":0.84745762711864414},20135.593220338986,null,0,0.2,0.3,0.3,0.2,0,0,0,null,null,0,0.2,0.3,0.3,0.2,0,0,0,null,null,0,4752,7128,7128,4752,0,0,0,0,0,4027.1186440677975,6040.6779661016953,6040.6779661016953,4027.1186440677975,0,0,0,0]
[null,null,"Tarea 1.2.1.3","Viáticos","día/persona",{"$f":"4*2*12","v":96},320,{"$f":"+G34*F34","v":30720},{"$f":"1/(1.18)","v":0.84745762711864414},26033.898305084749,null,0,0.2,0.3,0.3,0.2,0,0,0,null,null,0,0.2,0.3,0.3,0.2,0,0,0,null,null,0,6144,9216,9216,6144,0,0,0,0,0,5206.7796610169498,7810.1694915254247,7810.1694915254247,5206.7796610169498,0,0,0,0]
[null,"COMPONENTE 2.Suficiente y adecuado equipamiento para la generación, procesamiento, almacenamiento y distribución de información temática",null,null,null,null,null,{"$f":"+H36+H40","v":452462},null,{"$f":"+J36+J40","v":383442.37288135593},null,null,null,null,null,null,null,null,null,null,null,null,null,null,null,null,null,null,null,null,null,{"$f":"+AF36+AF40","v":0},278308,0,0,0,0,0,174154,0,{"$f":"+AO36+AO40","v":0},235854.2372881356,0,0,0,0,0,147588.13559322036,0]
[null,"Acción 2.1","…",null,null,null,null,{"$f":"+SUM(H37:H39)","v":278308},null,{"$f":"+SUM(J37:J39)","v":235854.2372881356},null,null,null,null,null,null,null,null,null,null,null,null,null,null,null,null,null,null,null,null,null,{"$f":"+SUM(AF37:AF39)","v":0},278308,0,0,0,0,0,0,0,{"$f":"+SUM(AO37:AO39)","v":0},235854.2372881356,0,0,0,0,0,0,0]
[null,"Act. 2.1.1","Hardware",null,"Global",1,100000,{"$f":"+G37*F37","v":100000},{"$f":"1/(1.18)","v":0.84745762711864414},{"$f":"+I37*H37","v":84745.762711864416},null,0,1,0,0,0,0,0,0,null,null,{"$f":"+L37","v":0},1,0,0,0,0,0,0,null,null,{"$f":"+L37*$H37","v":0},100000,0,0,0,0,0,0,0,{"$f":"+L37*$J37","v":0},84745.762711864416,0,0,0,0,0,0,0]
[null,"Act. 2.1.2","Software: ESRI-ArcGIS Avanzado (Uso individual) v.10.5",null,"Licencia",2,{"$f":"74154","v":74154},148308,{"$f":"1/(1.18)","v":0.84745762711864414},{"$f":"+I38*H38","v":125684.74576271187},null,0,1,0,0,0,0,0,0,null,null,0,1,0,0,0,0,0,0,null,null,0,148308,0,0,0,0,0,0,0,0,125684.74576271187,0,0,0,0,0,0,0]
[null,"Act. 2.1.3","Equipamiento menor (gps, drones,etc.)",null,"Global",1,30000,30000,{"$f":"1/(1.18)","v":0.84745762711864414},{"$f":"+I39*H39","v":25423.728813559323},null,0,1,0,0,0,0,0,0,null,null,0,1,0,0,0,0,0,0,null,null,0,30000,0,0,0,0,0,0,0,0,25423.728813559323,0,0,0,0,0,0,0]
[null,"Acción 2.2","…",null,null,null,null,{"$f":"+H41+H42","v":174154},null,{"$f":"+J41+J42","v":147588.13559322036},null,null,null,null,null,null,null,null,null,null,null,null,null,null,null,null,null,null,null,null,null,{"$f":"+AF41+AF42","v":0},0,0,0,0,0,0,174154,0,{"$f":"+AO41+AO42","v":0},0,0,0,0,0,0,147588.13559322036,0]
[null,"Act. 2.1.1","Hardware",null,"Global",1,100000,100000,{"$f":"1/(1.18)","v":0.84745762711864414},{"$f":"+I41*H41","v":84745.762711864416},null,0,0,0,0,0,0,0,1,null,null,{"$f":"+L41","v":0},0,0,0,0,0,0,1,null,null,{"$f":"+L41*$H41","v":0},0,0,0,0,0,0,100000,0,{"$f":"+L41*$J41","v":0},0,0,0,0,0,0,84745.762711864416,0]
[null,"Act. 2.1.2","Software: ESRI-ArcGIS Avanzado (Uso individual) v.10.5",null,"Licencia",1,{"$f":"+G38","v":74154},74154,{"$f":"1/(1.18)","v":0.84745762711864414},{"$f":"+I42*H42","v":62842.372881355936},null,0,0,0,0,0,0,0,1,null,null,0,0,0,0,0,0,0,1,null,null,0,0,0,0,0,0,0,74154,0,0,0,0,0,0,0,0,62842.372881355936,0]
[null,"COMPONENTE 3 .Bases de datos y mapas temáticos actualizados, integrados, compatibles y disponibles",null,null,null,null,null,{"$f":"+H44","v":1898751},null,{"$f":"+J44","v":1609111.0169491526},null,null,null,null,null,null,null,null,null,null,null,null,null,null,null,null,null,null,null,null,null,{"$f":"+AF44","v":148511},364450,341666.66666666669,447061.66666666669,522061.66666666669,75000,0,0,0,{"$f":"+AO44","v":125856.77966101696},308855.93220338988,289548.0225988701,378865.81920903962,442425.14124293794,63559.322033898308,0,0,0]
[null,"Acción 3.1","…",null,null,null,null,{"$f":"+SUM(H45:H52)","v":1898751},null,{"$f":"+SUM(J45:J52)","v":1609111.0169491526},null,null,null,null,null,null,null,null,null,null,null,null,null,null,null,null,null,null,null,null,null,{"$f":"+SUM(AF45:AF52)","v":148511},364450,341666.66666666669,447061.66666666669,522061.66666666669,75000,0,0,0,{"$f":"+SUM(AO45:AO52)","v":125856.77966101696},308855.93220338988,289548.0225988701,378865.81920903962,442425.14124293794,63559.322033898308,0,0,0]
[null,"Act. 3.1.1","Elaboración del Mapa Base",null,"Mapa",1,{"$f":"+'[15]M1. Mapa Base'!H34","v":148511},{"$f":"+G45*F45","v":148511},{"$f":"1/(1.18)","v":0.84745762711864414},{"$f":"+I45*H45","v":125856.77966101696},null,1,0,0,0,0,0,0,0,null,null,{"$f":"+L45","v":1},0,0,0,0,0,0,0,null,null,{"$f":"+L45*$H45","v":148511},0,0,0,0,0,0,0,0,{"$f":"+L45*$J45","v":125856.77966101696},0,0,0,0,0,0,0,0]
[null,"Act. 3.1.2","Elaboración del Mapa de Dinámica Poblacionales",null,"Mapa",1,{"$f":"+'[15]M2. Centros Poblados'!H39","v":128660},128660,0.84745762711864414,{"$f":"+I46*H46","v":109033.89830508476},null,0,1,0,0,0,0,0,0,null,null,0,1,0,0,0,0,0,0,null,null,0,128660,0,0,0,0,0,0,0,0,109033.89830508476,0,0,0,0,0,0,0]
[null,"Act. 3.1.3","Elaboración del Mapa Forestal",null,"Mapa",1,200000,200000,0.84745762711864414,169491.52542372883,null,0,0,0,0.5,0.5,0,0,0,null,null,0,0,0,0.5,0.5,0,0,0,null,null,0,0,0,100000,100000,0,0,0,0,0,0,0,84745.762711864416,84745.762711864416,0,0,0,0]
[null,"Act. 3.1.4","Elaboración del Mapa de Capacidad de Uso Mayor de las Tierras",null,"Mapa",1,800000,800000,0.84745762711864414,677966.10169491533,null,0,0,0.33333333333333337,0.33333333333333337,0.33333333333333337,0,0,0,null,null,0,0,0.33333333333333337,0.33333333333333337,0.33333333333333337,0,0,0,null,null,0,0,266666.66666666669,266666.66666666669,266666.66666666669,0,0,0,0,0,0,225988.7005649718,225988.7005649718,225988.7005649718,0,0,0,0]
[null,"Act. 3.1.5","Elaboración del Mapa de Ecosistemas priorizados para la conservación de la biodiversidad",null,"Mapa",1,{"$f":"+'[15]M5. EPC'!H109","v":160790},160790,0.84745762711864414,136262.7118644068,null,null,1,0,0,0,0,0,0,null,null,0,1,0,0,0,0,0,0,null,null,0,160790,0,0,0,0,0,0,0,0,136262.7118644068,0,0,0,0,0,0,0]
[null,"Act. 3.1.6","Elaboración del Mapa de Hábitats Críticos",null,"Mapa",1,{"$f":"+'[15]M5. EPC'!H109","v":160790},160790,0.84745762711864414,136262.7118644068,null,0,0,0,0.5,0.5,0,0,0,null,null,0,0,0,0.5,0.5,0,0,0,null,null,0,0,0,80395,80395,0,0,0,0,0,0,0,68131.355932203398,68131.355932203398,0,0,0,0]
[null,"Act. 3.1.7","Elaboración del Mapa de Fisiografía",null,"Mapa",1,150000,150000,0.84745762711864414,127118.64406779662,null,null,0.5,0.5,0,0,0,0,0,null,null,0,0.5,0.5,0,0,0,0,0,null,null,0,75000,75000,0,0,0,0,0,0,0,63559.322033898308,63559.322033898308,0,0,0,0,0,0]
[null,"Act. 3.1.8","Elaboración del Mapa de Uso Actual de la Tierra con enfásis en sistemas agroforestales",null,"Mapa",1,150000,150000,0.84745762711864414,127118.64406779662,null,0,0,0,null,0.5,0.5,0,0,null,null,0,0,0,0,0.5,0.5,0,0,null,null,0,0,0,0,75000,75000,0,0,0,0,0,0,0,63559.322033898308,63559.322033898308,0,0,0]
[null,"COMPONENTE 4.Difusión y sensibilización sobre el proceso de zonificación forestal",null,null,null,null,null,{"$f":"+H54+H63","v":179500},null,{"$f":"+J54+J63","v":154446.25},null,null,null,null,null,null,null,null,null,null,null,null,null,null,null,null,null,null,null,null,null,{"$f":"+AF54+AF63","v":0},0,0,45500,33500,50250,50250,0,0,{"$f":"+AO54+AO63","v":0},0,0,39025.25,28855.25,43282.875,43282.875,0,0]
[null,"Acción 4.1","…",null,null,null,null,{"$f":"+SUM(H55:H62)","v":51500},null,{"$f":"+SUM(J55:J62)","v":43646.25},null,null,null,null,null,null,null,null,null,null,null,null,null,null,null,null,null,null,null,null,null,{"$f":"+SUM(AF55:AF62)","v":0},0,0,19900,7900,11850,11850,0,0,{"$f":"+SUM(AO55:AO62)","v":0},0,0,16865.25,6695.25,10042.875,10042.875,0,0]
[null,"Act. 4.1.1","Elaboración de cartillas informativas, afiches, difusión en radio, televisión y prensa, Portal web",null,null,null,null,null,null,null,null,null,null,null,null,null,null,null,null,null,null,null,null,null,null,null,null,null,null,null,null,null,null,null,null,null,null,null,null,0,null,null,null,null,null,null,null,null,0]
[null,null,"Tarea 4.1.1.1","Spot Radial","Mes",6,2000,{"$f":"+G56*F56","v":12000},0.84750000000000003,10170,null,0,0,0,0.2,0.2,0.3,0.3,0,null,null,{"$f":"+L56","v":0},0,0,0.2,0.2,0.3,0.3,0,null,null,{"$f":"+L56*$H56","v":0},0,0,2400,2400,3600,3600,0,0,{"$f":"+L56*$J56","v":0},0,0,2034,2034,3051,3051,0,0]
[null,null,"Tarea 4.1.1.2","Spot Televisivo","Mes",6,2250,13500,0.84750000000000003,11441.25,null,0,0,0,0.2,0.2,0.3,0.3,0,null,null,0,0,0,0.2,0.2,0.3,0.3,0,null,null,0,0,0,2700,2700,4050,4050,0,0,0,0,0,2288.25,2288.25,3432.375,3432.375,0,0]
[null,null,"Tarea 4.1.1.3","Redes Sociales","Mes",1,2000,2000,0.84750000000000003,1695,null,0,0,0,0.2,0.2,0.3,0.3,0,null,null,0,0,0,0.2,0.2,0.3,0.3,0,null,null,0,0,0,400,400,600,600,0,0,0,0,0,339,339,508.5,508.5,0,0]
[null,null,"Tarea 4.1.1.4","Portal Web GORE","Mes",1,2000,2000,0.84750000000000003,1695,null,0,0,0,0.2,0.2,0.3,0.3,0,null,null,0,0,0,0.2,0.2,0.3,0.3,0,null,null,0,0,0,400,400,600,600,0,0,0,0,0,339,339,508.5,508.5,0,0]
[null,null,"Tarea 4.1.1.5","Tripticos","Millar",10,600,6000,0.84750000000000003,5085,null,0,0,0,1,0,0,0,0,null,null,0,0,0,1,0,0,0,0,null,null,0,0,0,6000,0,0,0,0,0,0,0,0,5085,0,0,0,0,0]
[null,null,"Tarea 4.1.1.6","Afiches","Millar",10,600,6000,0.84750000000000003,5085,null,0,0,0,1,0,0,0,0,null,null,0,0,0,1,0,0,0,0,null,null,0,0,0,6000,0,0,0,0,0,0,0,0,5085,0,0,0,0,0]
[null,"Act. 4.1.2","Elaboración de materiales varios",null,"Global",1,10000,{"$f":"+G62*F62","v":10000},0.84750000000000003,{"$f":"+I62*H62","v":8475},null,0,0,0,0.2,0.2,0.3,0.3,0,null,null,0,0,0,0.2,0.2,0.3,0.3,0,null,null,0,0,0,2000,2000,3000,3000,0,0,0,0,0,1695,1695,2542.5,2542.5,0,0]
[null,"Acción 4.2","…",null,null,null,null,{"$f":"+SUM(H64:H66)","v":128000},null,{"$f":"+SUM(J64:J66)","v":110800},null,null,null,null,null,null,null,null,null,null,null,null,null,null,null,null,null,null,null,null,null,{"$f":"+SUM(AF64:AF66)","v":0},0,0,25600,25600,38400,38400,0,0,{"$f":"+SUM(AO64:AO66)","v":0},0,0,22160,22160,33240,33240,0,0]
[null,"Act. 4.2.1","Facilitador Intercultural (comunicador)",null,"Mes",8,4000,{"$f":"+G64*F64","v":32000},0.92,{"$f":"+I64*H64","v":29440},null,0,0,0,0.2,0.2,0.3,0.3,0,null,null,{"$f":"+L64","v":0},0,0,0.2,0.2,0.3,0.3,0,null,null,{"$f":"+L64*$H64","v":0},0,0,6400,6400,9600,9600,0,0,{"$f":"+L64*$J64","v":0},0,0,5888,5888,8832,8832,0,0]
[null,"Act. 4.2.2","Presentación pública del Proceso de ZF",null,"Taller",12,{"$f":"+G8","v":4000},{"$f":"+G65*F65","v":48000},0.84750000000000003,{"$f":"+I65*H65","v":40680},null,0,0,0,0.2,0.2,0.3,0.3,0,null,null,0,0,0,0.2,0.2,0.3,0.3,0,null,null,0,0,0,9600,9600,14400,14400,0,0,0,0,0,8136,8136,12204,12204,0,0]
[null,"Act. 4.2.3","Talleres de difusión y sensibilización en cada provincia",null,"Taller",12,{"$f":"+G65","v":4000},{"$f":"+G66*F66","v":48000},0.84750000000000003,{"$f":"+I66*H66","v":40680},null,0,0,0,0.2,0.2,0.3,0.3,0,null,null,0,0,0,0.2,0.2,0.3,0.3,0,null,null,0,0,0,9600,9600,14400,14400,0,0,0,0,0,8136,8136,12204,12204,0,0]
[null,"COMPONENTE 5.Adecuados mecanismos y espacios de participación  en el proceso de ZF",null,null,null,null,null,{"$f":"+H68+H72","v":259600},null,{"$f":"+J68+J72","v":220011},null,null,null,null,null,null,null,null,null,null,null,null,null,null,null,null,null,null,null,null,null,{"$f":"+AF68+AF72","v":0},0,129800,0,0,51920,51920,25960,0,{"$f":"+AO68+AO72","v":0},0,110005.5,0,0,44002.2,44002.2,22001.1,0]
[null,"Acción 5.1","…",null,null,null,null,{"$f":"+SUM(H69:H71)","v":129800},null,{"$f":"+SUM(J69:J71)","v":110005.5},null,null,null,null,null,null,null,null,null,null,null,null,null,null,null,null,null,null,null,null,null,{"$f":"+SUM(AF69:AF71)","v":0},0,0,0,0,51920,51920,25960,0,{"$f":"+SUM(AO69:AO71)","v":0},0,0,0,0,44002.2,44002.2,22001.1,0]
[null,"Act. 5.1.1","Materiales",null,"Global",1,5000,{"$f":"+G69*F69","v":5000},0.84750000000000003,{"$f":"+I69*H69","v":4237.5},null,0,0,0,0,0,0.4,0.4,0.2,null,null,{"$f":"+L69","v":0},0,0,0,0,0.4,0.4,0.2,null,null,{"$f":"+L69*$H69","v":0},0,0,0,0,2000,2000,1000,0,{"$f":"+L69*$J69","v":0},0,0,0,0,1695,1695,847.5,0]
[null,"Act. 5.1.2","Talleres",null,"Taller",12,{"$f":"+G8","v":4000},{"$f":"+G70*F70","v":48000},0.84750000000000003,40680,null,0,0,0,0,0,0.4,0.4,0.2,null,null,0,0,0,0,0,0.4,0.4,0.2,null,null,0,0,0,0,0,19200,19200,9600,{"$f":"+H70-SUM(AF70:AM70)","v":0},0,0,0,0,0,16272,16272,8136,{"$f":"+J70-SUM(AO70:AV70)","v":0}]
[null,"Act. 5.1.3","Viáticos",null,"día/persona",{"$f":"20*F70","v":240},{"$f":"+G23","v":320},76800,0.84750000000000003,65088,null,0,0,0,0,0,0.4,0.4,0.2,null,null,0,0,0,0,0,0.4,0.4,0.2,null,null,0,0,0,0,0,30720,30720,15360,0,0,0,0,0,0,26035.200000000001,26035.200000000001,13017.6,0]
[null,"Acción 5.2","…",null,null,null,null,{"$f":"+SUM(H73:H75)","v":129800},null,{"$f":"+SUM(J73:J75)","v":110005.5},null,null,null,null,null,null,null,null,null,null,null,null,null,null,null,null,null,null,null,null,null,{"$f":"+SUM(AF73:AF75)","v":0},0,129800,0,0,0,0,0,0,{"$f":"+SUM(AO73:AO75)","v":0},0,110005.5,0,0,0,0,0,0]
[null,"Act. 5.1.1","Materiales",null,"Global",1,5000,{"$f":"+G73*F73","v":5000},0.84750000000000003,{"$f":"+I73*H73","v":4237.5},null,0,0,1,0,0,0,0,0,null,null,{"$f":"+L73","v":0},0,1,0,0,0,0,0,null,null,{"$f":"+L73*$H73","v":0},0,5000,0,0,0,0,0,0,{"$f":"+L73*$J73","v":0},0,4237.5,0,0,0,0,0,0]
[null,"Act. 5.1.2","Talleres",null,"Taller",12,{"$f":"+G70","v":4000},{"$f":"+G74*F74","v":48000},0.84750000000000003,40680,null,0,0,1,0,0,0,0,0,null,null,0,0,1,0,0,0,0,0,null,null,0,0,48000,0,0,0,0,0,0,0,0,40680,0,0,0,0,0,0]
[null,"Act. 5.1.3","Viáticos",null,"día/persona",{"$f":"20*F74","v":240},{"$f":"+G71","v":320},76800,0.84750000000000003,65088,null,0,0,1,0,0,0,0,0,null,null,0,0,1,0,0,0,0,0,null,null,0,0,76800,0,0,0,0,0,0,0,0,65088,0,0,0,0,0,0]
[]
[null,"GESTIÓN DEL PROYECTO",null,null,null,null,null,{"$f":"+SUM(H78:H90)","v":297900},null,{"$f":"+SUM(J78:J90)","v":270738.30508474575},null,null,null,null,null,null,null,null,null,null,null,null,null,null,null,null,null,null,null,null,null,{"$f":"+SUM(AF78:AF90)","v":31500},{"$f":"+SUM(AG78:AG90)","v":37985.714285714283},37985.714285714283,37985.714285714283,37985.714285714283,37985.714285714283,37985.714285714283,38485.714285714283,0,{"$f":"+SUM(AO78:AO90)","v":28980},34476.368038740919,34476.368038740919,34476.368038740919,34476.368038740919,34476.368038740919,34476.368038740919,34900.096852300245,0]
[null,"Act.1","Expediente Técnico",null,null,null,null,null,null,null,null,null,null,null,null,null,null,null,null,null,null,null,null,null,null,null,null,null,null,null,null,null,null,null,null,null,null,null,null,0,null,null,null,null,null,null,null,null,0]
[null,"Act.2","Supervisión",null,null,null,null,null,null,null,null,null,null,null,null,null,null,null,null,null,null,null,null,null,null,null,null,null,null,null,null,null,null,null,null,null,null,null,null,0,null,null,null,null,null,null,null,null,0]
[null,"Act.3","Liquidación del Proyecto",null,null,null,null,null,null,null,null,null,null,null,null,null,null,null,null,null,null,null,null,null,null,null,null,null,null,null,null,null,null,null,null,null,null,null,null,0,null,null,null,null,null,null,null,null,0]
[null,"Act.4","Personal",null,null,null,null,null,null,null,null,null,null,null,null,null,null,null,null,null,null,null,null,null,null,null,null,null,null,null,null,null,null,null,null,null,null,null,null,0,null,null,null,null,null,null,null,null,0]
[null,null,"Act. 4.1","Jefe de Proyecto","mes",{"$f":"12*2","v":24},7000,{"$f":"+G82*F82","v":168000},0.92,{"$f":"+I82*H82","v":154560},null,0.125,0.125,0.125,0.125,0.125,0.125,0.125,0.125,null,null,{"$f":"+L82","v":0.125},0.125,0.125,0.125,0.125,0.125,0.125,0.125,null,null,{"$f":"+L82*$H82","v":21000},21000,21000,21000,21000,21000,21000,21000,0,{"$f":"+L82*$J82","v":19320},19320,19320,19320,19320,19320,19320,19320,0]
[null,null,"Act. 4.2","Administrador","mes",{"$f":"12*2","v":24},3500,{"$f":"+G83*F83","v":84000},0.92,{"$f":"+I83*H83","v":77280},null,0.125,0.125,0.125,0.125,0.125,0.125,0.125,0.125,null,null,0.125,0.125,0.125,0.125,0.125,0.125,0.125,0.125,null,null,10500,10500,10500,10500,10500,10500,10500,10500,0,9660,9660,9660,9660,9660,9660,9660,9660,0]
[null,null,"Act. 4.3","Asistente",null,null,null,null,null,null,null,null,null,null,null,null,null,null,null,null,null,null,null,null,null,null,null,null,null,null,null,null,null,null,null,null,null,null,null,0,null,null,null,null,null,null,null,null,0]
[null,"Act.5","Gastos Administrativos",null,null,null,null,null,null,null,null,null,null,null,null,null,null,null,null,null,null,null,null,null,null,null,null,null,null,null,null,null,null,null,null,null,null,null,null,0,null,null,null,null,null,null,null,null,0]
[null,null,"Act. 5.1","Courier (Remisión de expediente a SERFOR/MINAM)","Global",1,500,{"$f":"+G86*F86","v":500},{"$f":"1/(1.18)","v":0.84745762711864414},{"$f":"+I86*H86","v":423.72881355932208},null,0,0,0,0,0,0,0,1,null,null,{"$f":"+L86","v":0},0,0,0,0,0,0,1,null,null,{"$f":"+L86*$H86","v":0},0,0,0,0,0,0,500,0,{"$f":"+L86*$J86","v":0},0,0,0,0,0,0,423.72881355932208,0]
[null,null,"Act. 5.2","Pasajes aéreos  (I/V) / Asistencia Técnica Serfor","Pasaje",40,{"$f":"150*3.3","v":495},{"$f":"+G87*F87","v":19800},{"$f":"1/(1.18)","v":0.84745762711864414},{"$f":"+I87*H87","v":16779.661016949154},null,0,0.14285714285714288,{"$f":"+M87","v":0.14285714285714288},0.14285714285714288,0.14285714285714288,0.14285714285714288,0.14285714285714288,0.14285714285714288,null,null,0,0.14285714285714288,0.14285714285714288,0.14285714285714288,0.14285714285714288,0.14285714285714288,0.14285714285714288,0.14285714285714288,null,null,0,2828.5714285714289,2828.5714285714289,2828.5714285714289,2828.5714285714289,2828.5714285714289,2828.5714285714289,2828.5714285714289,0,0,2397.0944309927368,2397.0944309927368,2397.0944309927368,2397.0944309927368,2397.0944309927368,2397.0944309927368,2397.0944309927368,0]
[null,null,"Act. 5.3","Viáticos / Asistencia Técnica Serfor","día/persona",80,320,{"$f":"+G88*F88","v":25600},{"$f":"1/(1.18)","v":0.84745762711864414},{"$f":"+I88*H88","v":21694.91525423729},null,0,0.14285714285714288,0.14285714285714288,0.14285714285714288,0.14285714285714288,0.14285714285714288,0.14285714285714288,0.14285714285714288,null,null,0,0.14285714285714288,0.14285714285714288,0.14285714285714288,0.14285714285714288,0.14285714285714288,0.14285714285714288,0.14285714285714288,null,null,0,3657.1428571428578,3657.1428571428578,3657.1428571428578,3657.1428571428578,3657.1428571428578,3657.1428571428578,3657.1428571428578,0,0,3099.273607748185,3099.273607748185,3099.273607748185,3099.273607748185,3099.273607748185,3099.273607748185,3099.273607748185,0]
[null,null,"Act. 5.4","Otros gastos",null,null,null,null,null,null,null,null,null,null,null,null,null,null,null,null,null,null,null,null,null,null,null,null,null,null,null,null,null,null,null,null,null,null,null,0,null,null,null,null,null,null,null,null,0]
[null,null,null,null,null,null,null,null,null,null,null,null,null,null,null,null,null,null,null,null,null,null,null,null,null,null,null,null,null,null,null,null,null,null,null,null,null,null,null,0,null,null,null,null,null,null,null,null,0]
[null,"Costo Total de Inversión",null,null,null,null,null,{"$f":"+H67+H53+H43+H35+H5+H77","v":3753623.96},null,{"$f":"+J67+J53+J43+J35+J5+J77","v":3229512.8093220335},null,null,null,null,null,null,null,null,null,null,null,null,null,null,null,null,null,null,null,null,null,{"$f":"+AF67+AF53+AF43+AF35+AF5+AF77","v":313101.95999999996},815879.71428571432,598396.38095238106,619491.38095238106,668843.38095238106,263155.71428571426,188155.71428571429,286599.71428571426,{"$f":"+H91-SUM(AF91:AM91)","v":0},{"$f":"+AO67+AO53+AO43+AO35+AO5+AO77","v":271107.76271186443},697190.60532687663,512888.19572235679,531225.74233252625,573048.96267150936,229480.76507263922,165921.44303874092,248649.33244552062,0]

{"sheet":"Hoja1","index":57,"n_rows":30,"n_cols":7,"rows_kept":30,"cut":false,"hidden":true,"merged":[]}
[]
[null,null,"Sí",1,"Celda vinculada"]
[null,null,"No",0]
[]
[null,null,"Sí",1,"Celda vinculada"]
[null,null,"No",0]
[]
[null,null,"Sí",1,"Celda vinculada"]
[null,null,"No",0]
[null,null,null,null,null,null,0]
[null,null,"Sí",1,"Celda vinculada",null,1]
[null,null,"No",0,3,null,2]
[null,null,null,null,null,null,3]
[null,null,"Sí",1,"Celda vinculada",null,4]
[null,null,"No",0,3,null,5]
[null,null,null,null,null,null,6]
[null,null,"Sí",1,"Celda vinculada",null,7]
[null,null,"No",0,null,null,8]
[null,null,null,null,null,null,9]
[null,null,"Sí",1,"Celda vinculada",null,10]
[null,null,"No",0]
[]
[null,null,"Sí",1,"Celda vinculada"]
[null,null,"No",0]
[]
[null,null,"Sí",1,"Celda vinculada"]
[null,null,"No",0]
[]
[null,null,"Sí",1,"Celda vinculada"]
[null,null,"No",0]

{"sheet":"Hoja2","index":58,"n_rows":38,"n_cols":19,"rows_kept":38,"cut":false,"hidden":true,"merged":[[11,5,11,6],[11,7,11,8],[11,9,11,10]]}
[]
[]
[null,"Cooperante"]
[null,"Beneficiario"]
[null,"Oponente"]
[null,"Perjudicado"]
[]
[]
[]
[]
[null,null,null,null,null,null,null,null,null,null,null,null,null,null,8,null,1,null,1]
[null,null,null,null,null,null,null,null,null,null,null,null,null,null,1,null,1,null,1]
[null,null,null,null,null,null,null,null,null,null,null,null,null,null,1,null,1,null,1]
[null,null,null,null,null,null,null,null,null,null,null,null,null,null,1,null,1,null,1]
[null,null,null,null,null,null,null,null,null,null,null,null,null,null,1,null,1,null,1]
[null,null,null,null,null,null,null,null,null,null,null,null,null,null,1,null,1,null,1]
[null,null,null,null,null,null,null,null,null,null,null,null,null,null,1,null,1,null,1]
[null,null,null,null,null,null,null,null,null,null,null,null,null,null,1,null,1,null,1]
[null,null,null,null,null,null,null,null,null,null,null,null,null,null,1,null,1,null,1]
[null,null,null,null,null,null,null,null,null,null,null,null,null,null,1,null,1,null,1]
[null,null,null,null,null,null,null,null,null,null,null,null,null,null,1,null,1,null,1]
[null,null,null,null,null,null,null,null,null,null,null,null,null,null,1,null,1,null,1]
[null,null,null,null,null,null,null,null,null,null,null,null,null,null,1,null,1,null,1]
[null,null,null,null,null,null,null,null,null,null,null,null,null,null,1,null,1,null,1]
[]
[]
[]
[]
[]
[]
[null,"Especificaciones técnicas"]
[null,"Garantía del servicio de mantenimiento a los equipos",null,null,null,null,null,null,null,"Sí"]
[null,"Grado de dependencia del proveedor",null,null,null,null,null,null,null,"No"]
[null,"Entrenamiento que brindará el proveedor"]
[null,"Obsolescencia tecnológica"]
[null,"Seguridad industrial y riesgos ambientales asociados"]
[null,"Condiciones climáticas y físicas"]
[null,"Disponibilidad de recursos"]